RESNUM,RESNAME,H_X,H_Y,H_BEST_REF_SCORE,H_BEST_REF_COV,H_BEST_REF_MATCH,H_UCBShift,HA_X,HA_Y,HA_BEST_REF_SCORE,HA_BEST_REF_COV,HA_BEST_REF_MATCH,HA_UCBShift,C_X,C_Y,C_BEST_REF_SCORE,C_BEST_REF_COV,C_BEST_REF_MATCH,C_UCBShift,CA_X,CA_Y,CA_BEST_REF_SCORE,CA_BEST_REF_COV,CA_BEST_REF_MATCH,CA_UCBShift,CB_X,CB_Y,CB_BEST_REF_SCORE,CB_BEST_REF_COV,CB_BEST_REF_MATCH,CB_UCBShift,N_X,N_Y,N_BEST_REF_SCORE,N_BEST_REF_COV,N_BEST_REF_MATCH,N_UCBShift
1,GLY,8.38660010049395,,0.0,0.0,0,8.38660010049395,3.9321636317793316,,0.0,0.0,0,3.9321636317793316,174.24652480564436,,0.0,0.0,0,174.24652480564436,45.25369308273393,45.26,0.17537454927569437,0.9481481481481482,1,45.30998213324453,,,0.0,0.0,0,,110.492180405439,,0.0,0.0,0,110.492180405439
2,SER,8.336989005705407,8.11,0.17537454927569437,0.9481481481481482,1,8.165392264785215,4.49691460985126,4.51,0.17537454927569437,0.9481481481481482,1,4.521022137629037,173.8732789996892,174.31,0.17537454927569437,0.9481481481481482,1,174.5092418678044,58.212864829115325,58.16,0.17537454927569437,0.9481481481481482,1,58.12542353679653,63.84737079410034,63.96,0.17537454927569437,0.9481481481481482,1,64.03569611285381,117.34160066103341,115.2,0.17537454927569437,0.9481481481481482,1,116.42190733745699
3,SER,8.150468311643913,8.54,0.17537454927569437,0.9481481481481482,1,8.503641295787546,4.4065637499667,4.43,0.17537454927569437,0.9481481481481482,1,4.46245326021201,174.5363712920524,174.71,0.17537454927569437,0.9481481481481482,1,174.66138356062825,58.26480272866023,58.36,0.17537454927569437,0.9481481481481482,1,58.45390821905317,63.68785927388167,63.76,0.17537454927569437,0.9481481481481482,1,63.76133484089244,118.76682191046176,117.4,0.17537454927569437,0.9481481481481482,1,117.63324209223555
4,GLY,8.35270049977245,8.4,0.17537454927569437,0.9481481481481482,1,8.443043227000777,3.9184355836718834,,0.0,0.0,0,3.9184355836718834,174.91644795147076,173.71,0.17537454927569437,0.9481481481481482,1,173.96099166153846,45.0048167495116,45.06,0.17537454927569437,0.9481481481481482,1,45.1134574522311,,,0.0,0.0,0,,110.71754441649462,110.2,0.17537454927569437,0.9481481481481482,1,110.68058549276834
5,SER,8.462601317515817,8.27,0.17537454927569437,0.9481481481481482,1,8.28761057947053,4.735377655988455,4.57,0.17537454927569437,0.9481481481481482,1,4.608085651964702,173.27990222825508,174.11,0.17537454927569437,0.9481481481481482,1,174.14042874291263,58.484222006832056,57.76,0.17537454927569437,0.9481481481481482,1,57.76518606550116,63.66694810714286,63.96,0.17537454927569437,0.9481481481481482,1,63.95388889069264,117.5508800449384,115.1,0.17537454927569437,0.9481481481481482,1,116.0790962503885
6,SER,8.032641317143968,8.27,0.17537454927569437,0.9481481481481482,1,8.222400725685427,5.592549184326786,4.91,0.17537454927569437,0.9481481481481482,1,5.077566385814186,173.86938103508712,173.81,0.17537454927569437,0.9481481481481482,1,173.9697850558275,57.16872547220557,57.86,0.17537454927569437,0.9481481481481482,1,57.81423764451104,65.38573730793651,64.66,0.17537454927569437,0.9481481481481482,1,64.81501379145298,116.38026746267066,116.7,0.17537454927569437,0.9481481481481482,1,117.03557196762682
7,GLY,8.863481351609503,8.38,0.17537454927569437,0.9481481481481482,1,8.476214427061826,4.249294069136419,,0.0,0.0,0,4.249294069136419,172.25875723164057,172.71,0.17537454927569437,0.9481481481481482,1,172.81685436744922,44.78776821102231,44.86,0.17537454927569437,0.9481481481481482,1,44.78830880437341,,,0.0,0.0,0,,112.64439078060828,109.3,0.17537454927569437,0.9481481481481482,1,109.84597069284604
8,SER,8.613377711238762,8.56,0.17537454927569437,0.9481481481481482,1,8.57947477837163,4.558215500893551,4.57,0.17537454927569437,0.9481481481481482,1,4.5738801054279055,175.59944886108892,176.01,0.17537454927569437,0.9481481481481482,1,175.92486078836163,58.23137768753468,57.36,0.17537454927569437,0.9481481481481482,1,57.50090237171717,64.76858639488289,65.26,0.17537454927569437,0.9481481481481482,1,65.16889060477855,117.06616966744367,115.1,0.17537454927569437,0.9481481481481482,1,115.51874439199689
9,ALA,8.8178183008991,9.68,0.17537454927569437,0.9481481481481482,1,9.626022889971141,3.9953233116605618,3.99,0.17537454927569437,0.9481481481481482,1,3.9814286663780667,178.8150646956488,177.91,0.17537454927569437,0.9481481481481482,1,178.20059196977468,55.6605971963148,55.56,0.17537454927569437,0.9481481481481482,1,55.58861757026307,18.56184875684316,16.46,0.17537454927569437,0.9481481481481482,1,16.662776803457657,125.13369512297147,126.3,0.17537454927569437,0.9481481481481482,1,126.46106093104673
10,LYS,8.100419708091907,8.66,0.17537454927569437,0.9481481481481482,1,8.629243043978244,3.6754655004218,3.59,0.17537454927569437,0.9481481481481482,1,3.621043342524142,177.9471414577034,178.71,0.17537454927569437,0.9481481481481482,1,178.73554248483737,59.62581576721612,60.16,0.17537454927569437,0.9481481481481482,1,60.093627265118215,31.97838605092685,32.16,0.17537454927569437,0.9481481481481482,1,32.257063961100016,117.04066572107337,116.5,0.17537454927569437,0.9481481481481482,1,117.0714235361472
11,ASN,8.007228593084694,8.05,0.17537454927569437,0.9481481481481482,1,8.08602918002553,4.403944432034632,4.21,0.17537454927569437,0.9481481481481482,1,4.286713267710068,177.39386677328227,176.31,0.17537454927569437,0.9481481481481482,1,176.60921744902873,56.02149087246642,56.26,0.17537454927569437,0.9481481481481482,1,56.20493501739927,38.44595321376956,38.66,0.17537454927569437,0.9481481481481482,1,38.71588052561327,117.86761714034299,118.6,0.17537454927569437,0.9481481481481482,1,118.90761107032966
12,ALA,8.259177347480298,7.9,0.17537454927569437,0.9481481481481482,1,7.973894815323566,3.5576538295177036,3.1,0.17537454927569437,0.9481481481481482,1,3.254796107253858,178.6081309378344,177.71,0.17537454927569437,0.9481481481481482,1,178.06649232248307,55.090192670135416,54.76,0.17537454927569437,0.9481481481481482,1,54.756900733910534,18.23265187713398,18.16,0.17537454927569437,0.9481481481481482,1,18.20970124617605,123.26753306364746,121.6,0.17537454927569437,0.9481481481481482,1,122.27010198779553
13,TYR,8.890696965956264,8.19,0.17537454927569437,0.9481481481481482,1,8.343889442474191,3.8601320358752362,3.62,0.17537454927569437,0.9481481481481482,1,3.701958975507826,177.3722108387446,177.11,0.17537454927569437,0.9481481481481482,1,177.25447195689867,62.393102387223884,62.66,0.17537454927569437,0.9481481481481482,1,62.61324982364302,38.65899229374514,38.76,0.17537454927569437,0.9481481481481482,1,38.78805728240648,119.53344250413475,117.1,0.17537454927569437,0.9481481481481482,1,117.90954103525918
14,THR,8.141181291919192,7.79,0.17537454927569437,0.9481481481481482,1,7.873078898190698,3.7441508154179157,3.75,0.17537454927569437,0.9481481481481482,1,3.770106728715729,176.97258922952045,177.61,0.17537454927569437,0.9481481481481482,1,177.6171641500888,66.99148905429016,66.16,0.17537454927569437,0.9481481481481482,1,66.2965891606227,68.7181356428405,68.56,0.17537454927569437,0.9481481481481482,1,68.517643289344,115.9864299083805,113.8,0.17537454927569437,0.9481481481481482,1,114.6907788561605
15,LYS,7.953366313164612,8.08,0.17537454927569437,0.9481481481481482,1,8.10652151146631,4.1979639817848815,3.91,0.17537454927569437,0.9481481481481482,1,3.9930799869352867,179.00483029819625,178.81,0.17537454927569437,0.9481481481481482,1,178.7827171557942,58.043323325591075,57.66,0.17537454927569437,0.9481481481481482,1,57.73366982334333,31.897337660228665,31.26,0.17537454927569437,0.9481481481481482,1,31.354344211211014,122.11400942491953,122.6,0.17537454927569437,0.9481481481481482,1,122.8231838964813
16,LEU,8.666776652697303,8.46,0.17537454927569437,0.9481481481481482,1,8.538360595598846,4.003758861988012,3.63,0.17537454927569437,0.9481481481481482,1,3.750227285458986,178.56260954461095,178.31,0.17537454927569437,0.9481481481481482,1,178.56899219297924,57.24523886470752,57.56,0.17537454927569437,0.9481481481481482,1,57.52399781923077,41.52405724367299,42.06,0.17537454927569437,0.9481481481481482,1,42.057315682212234,120.01412376284826,118.2,0.17537454927569437,0.9481481481481482,1,118.88453341532912
17,GLY,7.775987876395827,7.33,0.17537454927569437,0.9481481481481482,1,7.405462096486847,3.793387038070264,,0.0,0.0,0,3.793387038070264,175.71600692941504,174.61,0.17537454927569437,0.9481481481481482,1,174.9205316419858,46.73456531153291,46.06,0.17537454927569437,0.9481481481481482,1,45.96068362114552,,,0.0,0.0,0,,105.88301263083028,102.9,0.17537454927569437,0.9481481481481482,1,103.60969589857365
18,THR,7.724110297091798,7.62,0.17537454927569437,0.9481481481481482,1,7.681335123104674,4.289394114618714,4.32,0.17537454927569437,0.9481481481481482,1,4.336384268598068,175.04186566743255,174.01,0.17537454927569437,0.9481481481481482,1,174.45894276132756,62.91624642567432,62.66,0.17537454927569437,0.9481481481481482,1,62.69145123619158,70.42974372947607,70.26,0.17537454927569437,0.9481481481481482,1,70.3358458119991,110.91196444558774,110.0,0.17537454927569437,0.9481481481481482,1,110.79339360551114
19,ASP,8.136872464496614,8.21,0.17537454927569437,0.9481481481481482,1,8.243873921961372,4.8420208149239645,4.83,0.17537454927569437,0.9481481481481482,1,4.855534704018204,177.20066160671553,177.01,0.17537454927569437,0.9481481481481482,1,177.1124393211178,53.3626554467699,52.56,0.17537454927569437,0.9481481481481482,1,52.77074972304362,42.174611152009106,40.86,0.17537454927569437,0.9481481481481482,1,41.00276338646354,124.05081422614607,122.8,0.17537454927569437,0.9481481481481482,1,123.33710345520036
20,ASP,8.737526988117438,9.1,0.17537454927569437,0.9481481481481482,1,9.086055356465755,4.414423949847375,4.24,0.17537454927569437,0.9481481481481482,1,4.258770234654234,177.20871580749252,176.21,0.17537454927569437,0.9481481481481482,1,176.3320267299201,56.39371566507381,57.26,0.17537454927569437,0.9481481481481482,1,57.271268850555,40.945550222144526,40.66,0.17537454927569437,0.9481481481481482,1,40.60911686657232,125.82753725451217,128.1,0.17537454927569437,0.9481481481481482,1,128.09303002920967
21,ASN,8.066517416516817,8.48,0.17537454927569437,0.9481481481481482,1,8.473140560622712,4.835055563203464,4.92,0.17537454927569437,0.9481481481481482,1,4.953548493806195,174.3743553785714,174.21,0.17537454927569437,0.9481481481481482,1,174.37922992475302,53.278692107420355,53.06,0.17537454927569437,0.9481481481481482,1,53.15812462146187,38.80198854377844,39.36,0.17537454927569437,0.9481481481481482,1,39.41009374038184,115.21905624545455,113.8,0.17537454927569437,0.9481481481481482,1,114.19673913233989
22,ALA,7.966637284188034,7.33,0.17537454927569437,0.9481481481481482,1,7.387398682328783,5.132203758685759,5.31,0.17537454927569437,0.9481481481481482,1,5.29896837940393,176.43822132254414,177.01,0.17537454927569437,0.9481481481481482,1,177.06265812294373,51.703519234626484,50.76,0.17537454927569437,0.9481481481481482,1,51.06537911774892,20.16523796488512,20.26,0.17537454927569437,0.9481481481481482,1,20.431388379526034,123.74279961832056,122.0,0.17537454927569437,0.9481481481481482,1,122.46991358215118
23,GLN,9.050190282051283,9.03,0.17537454927569437,0.9481481481481482,1,9.080353396631146,4.98367972025752,4.68,0.17537454927569437,0.9481481481481482,1,4.716667451737152,173.99280054619825,172.91,0.17537454927569437,0.9481481481481482,1,173.1628840373349,53.97641489808525,52.96,0.17537454927569437,0.9481481481481482,1,53.01709300646021,34.2915003550505,30.86,0.17537454927569437,0.9481481481481482,1,31.68435661769897,120.00741753142968,119.6,0.17537454927569437,0.9481481481481482,1,120.25412118638029
24,LEU,8.950445814108114,9.62,0.17537454927569437,0.9481481481481482,1,9.591322624353426,5.173284931857032,5.16,0.17537454927569437,0.9481481481481482,1,5.153213902186703,174.52751193488177,173.11,0.17537454927569437,0.9481481481481482,1,173.65493686787656,54.05878028100233,53.76,0.17537454927569437,0.9481481481481482,1,53.8436599978022,43.82839022801643,45.06,0.17537454927569437,0.9481481481481482,1,44.94538622817738,126.01228299794094,125.1,0.17537454927569437,0.9481481481481482,1,125.48142368099123
25,LEU,9.261969964063715,9.2,0.17537454927569437,0.9481481481481482,1,9.277126893967145,5.252964817071817,5.25,0.17537454927569437,0.9481481481481482,1,5.265410406754357,174.09378910829724,172.41,0.17537454927569437,0.9481481481481482,1,172.77003254815185,53.02236186104451,52.76,0.17537454927569437,0.9481481481481482,1,52.78729088033633,44.92688021812077,44.96,0.17537454927569437,0.9481481481481482,1,44.958579362221116,128.9826470091353,128.0,0.17537454927569437,0.9481481481481482,1,128.68380030080476
26,ASP,9.188238178410478,9.34,0.17537454927569437,0.9481481481481482,1,9.406525547591299,5.211705345293596,5.18,0.17537454927569437,0.9481481481481482,1,5.197405938073039,177.46810957301034,178.21,0.17537454927569437,0.9481481481481482,1,177.99026541492952,53.23793483465979,52.26,0.17537454927569437,0.9481481481481482,1,52.26179661931402,42.17838801938617,42.26,0.17537454927569437,0.9481481481481482,1,42.465904464396715,128.13412677536908,128.6,0.17537454927569437,0.9481481481481482,1,128.72946136066713
27,ILE,8.748741565606617,8.65,0.17537454927569437,0.9481481481481482,1,8.69712726077811,5.053636568093019,5.47,0.17537454927569437,0.9481481481481482,1,5.410967155477856,176.37623708276723,176.21,0.17537454927569437,0.9481481481481482,1,176.1423356016539,60.53524672822733,60.56,0.17537454927569437,0.9481481481481482,1,60.49106050127095,38.039660129603725,38.36,0.17537454927569437,0.9481481481481482,1,38.364976257509156,120.26039881544567,119.1,0.17537454927569437,0.9481481481481482,1,119.10329192216673
28,ARG,8.310233740293041,7.76,0.17537454927569437,0.9481481481481482,1,7.79641062969253,4.180911672630147,4.17,0.17537454927569437,0.9481481481481482,1,4.172734824775224,175.27115754296815,174.81,0.17537454927569437,0.9481481481481482,1,174.92190588142415,56.43505658251748,57.06,0.17537454927569437,0.9481481481481482,1,57.073720964324565,30.815070968142965,30.96,0.17537454927569437,0.9481481481481482,1,31.044423864191362,120.71154326936397,120.9,0.17537454927569437,0.9481481481481482,1,121.42781014568764
29,ALA,8.44531866911977,8.44,0.17537454927569437,0.9481481481481482,1,8.47255632914308,4.332814123096348,4.2,0.17537454927569437,0.9481481481481482,1,4.20967445003885,178.51250773843935,178.81,0.17537454927569437,0.9481481481481482,1,178.80582962768344,52.15758718137418,52.06,0.17537454927569437,0.9481481481481482,1,51.883314386263734,19.7366180981685,18.96,0.17537454927569437,0.9481481481481482,1,19.026983352919306,122.74489979215784,119.6,0.17537454927569437,0.9481481481481482,1,120.09253697904873
30,THR,8.720711552813853,8.18,0.17537454927569437,0.9481481481481482,1,8.24727889020424,4.057675292626818,3.62,0.17537454927569437,0.9481481481481482,1,3.7027223698856697,176.7894046172494,177.51,0.17537454927569437,0.9481481481481482,1,177.51675789375068,65.57250361698857,65.76,0.17537454927569437,0.9481481481481482,1,65.78942732549118,68.55691816016206,68.36,0.17537454927569437,0.9481481481481482,1,68.38102664063715,115.80722007154512,115.7,0.17537454927569437,0.9481481481481482,1,116.03858831021755
31,ALA,8.369946487090687,8.66,0.17537454927569437,0.9481481481481482,1,8.651114028726829,4.2284661194083695,3.99,0.17537454927569437,0.9481481481481482,1,4.021741456288157,180.1809586944278,179.51,0.17537454927569437,0.9481481481481482,1,179.6119798804862,55.22810289165279,55.26,0.17537454927569437,0.9481481481481482,1,55.26836679647019,18.42029499906205,18.36,0.17537454927569437,0.9481481481481482,1,18.46314179990565,123.7262232528305,121.9,0.17537454927569437,0.9481481481481482,1,122.6319700639749
32,ASP,7.819884241908092,7.67,0.17537454927569437,0.9481481481481482,1,7.752585890953491,4.468191217188367,4.37,0.17537454927569437,0.9481481481481482,1,4.405619833716283,178.41431756011212,179.41,0.17537454927569437,0.9481481481481482,1,179.45247635503387,57.24333282099012,57.16,0.17537454927569437,0.9481481481481482,1,57.23126873542014,41.190060619913424,39.86,0.17537454927569437,0.9481481481481482,1,40.00197030758686,118.73599686851482,116.7,0.17537454927569437,0.9481481481481482,1,117.42407047256077
33,PHE,8.185345515490067,7.83,0.17537454927569437,0.9481481481481482,1,7.8367461727383745,4.55292171075036,4.26,0.17537454927569437,0.9481481481481482,1,4.334607283255633,177.21590005929627,177.71,0.17537454927569437,0.9481481481481482,1,177.80105182832725,60.619009461854816,60.66,0.17537454927569437,0.9481481481481482,1,60.63807449741925,38.0718313032523,37.76,0.17537454927569437,0.9481481481481482,1,37.86682343119104,118.62512007220558,121.0,0.17537454927569437,0.9481481481481482,1,121.35291377428682
34,ARG,8.134514120712621,7.26,0.17537454927569437,0.9481481481481482,1,7.303201109351759,4.165076908735709,4.16,0.17537454927569437,0.9481481481481482,1,4.184431328765679,178.16809552776112,176.71,0.17537454927569437,0.9481481481481482,1,177.2022137714175,58.69675257107337,57.56,0.17537454927569437,0.9481481481481482,1,57.782252702958154,30.588353259246308,30.76,0.17537454927569437,0.9481481481481482,1,30.760522204145854,118.30645872418137,115.4,0.17537454927569437,0.9481481481481482,1,115.99564110918526
35,GLN,8.056579874375625,7.83,0.17537454927569437,0.9481481481481482,1,7.881371356454657,4.292284436718837,4.32,0.17537454927569437,0.9481481481481482,1,4.322872325863026,177.2056733947941,176.01,0.17537454927569437,0.9481481481481482,1,176.4727175161505,57.63107029051504,57.16,0.17537454927569437,0.9481481481481482,1,57.22511652099012,29.72547738075258,30.46,0.17537454927569437,0.9481481481481482,1,30.433274138800087,118.62419225856921,113.9,0.17537454927569437,0.9481481481481482,1,115.11319967958708
36,VAL,8.182357091286491,8.35,0.17537454927569437,0.9481481481481482,1,8.408074889887889,4.102969529417805,4.22,0.17537454927569437,0.9481481481481482,1,4.208522465007214,176.64387119345656,176.61,0.17537454927569437,0.9481481481481482,1,176.65342683344988,63.528500121156625,63.36,0.17537454927569437,0.9481481481481482,1,63.41170559983905,33.12857526812077,34.36,0.17537454927569437,0.9481481481481482,1,34.09398444245199,118.56868077582418,117.3,0.17537454927569437,0.9481481481481482,1,117.91988244814075
37,GLY,8.109230552924853,8.24,0.17537454927569437,0.9481481481481482,1,8.240866815628815,4.193925280466756,,0.0,0.0,0,4.193925280466756,173.17741430700966,172.61,0.17537454927569437,0.9481481481481482,1,172.8760547763792,44.22925624973915,43.76,0.17537454927569437,0.9481481481481482,1,43.789538881618384,,,0.0,0.0,0,,107.71783195575536,109.1,0.17537454927569437,0.9481481481481482,1,109.87022281576756
38,SER,7.955152025452326,7.29,0.17537454927569437,0.9481481481481482,1,7.489770631174381,4.7435971165945165,3.57,0.17537454927569437,0.9481481481481482,1,4.08357477999223,170.87812129199688,167.51,0.17537454927569437,0.9481481481481482,1,168.73160143271727,55.312864258868906,55.56,0.17537454927569437,0.9481481481481482,1,55.5950020979576,64.92254328664113,63.66,0.17537454927569437,0.9481481481481482,1,63.845664139960036,112.9299020002664,115.2,0.17537454927569437,0.9481481481481482,1,115.1355059010545
39,PRO,,,0.0,0.0,0,,3.9883355237623492,3.77,0.17537454927569437,0.9481481481481482,1,3.7923211852203353,175.40598589560994,174.91,0.17537454927569437,0.9481481481481482,1,175.2752335770008,63.33641595244755,62.56,0.17537454927569437,0.9481481481481482,1,62.64791697711178,31.257277852591855,31.16,0.17537454927569437,0.9481481481481482,1,31.136056848007552,,,0.0,0.0,0,
40,ASN,8.653719125485626,7.84,0.17537454927569437,0.9481481481481482,1,8.0169999999112,4.811329024336775,4.91,0.17537454927569437,0.9481481481481482,1,4.910645744089245,175.38524247806637,175.91,0.17537454927569437,0.9481481481481482,1,175.98017369873457,51.88666057814408,50.76,0.17537454927569437,0.9481481481481482,1,51.01233866352536,38.11374787610168,38.86,0.17537454927569437,0.9481481481481482,1,38.737347974253524,120.68503344797425,118.1,0.17537454927569437,0.9481481481481482,1,118.87489407075702
41,ILE,7.667407446653347,8.71,0.17537454927569437,0.9481481481481482,1,8.543716281074481,4.59000155528083,4.79,0.17537454927569437,0.9481481481481482,1,4.713746523659674,177.1293142111555,176.11,0.17537454927569437,0.9481481481481482,1,176.2939757879232,61.30377697748363,60.26,0.17537454927569437,0.9481481481481482,1,60.38187722086802,38.28247171923632,37.76,0.17537454927569437,0.9481481481481482,1,37.83268612162837,118.47248095634366,116.7,0.17537454927569437,0.9481481481481482,1,117.44552091229882
42,LYS,8.216250117210567,8.36,0.17537454927569437,0.9481481481481482,1,8.372633096958596,4.378497896686647,4.34,0.17537454927569437,0.9481481481481482,1,4.3691429126873125,178.86724045351315,180.91,0.17537454927569437,0.9481481481481482,1,180.58091248984348,58.737125892790544,59.36,0.17537454927569437,0.9481481481481482,1,59.348684017665676,31.730434905083808,32.06,0.17537454927569437,0.9481481481481482,1,32.039635490692646,122.98428547848818,124.7,0.17537454927569437,0.9481481481481482,1,124.76515908407148
43,GLY,8.511821318764568,8.53,0.17537454927569437,0.9481481481481482,1,8.58599819999445,3.991401053102453,,0.0,0.0,0,3.991401053102453,175.00761753785105,174.01,0.17537454927569437,0.9481481481481482,1,174.33933377582974,46.18178734082584,45.86,0.17537454927569437,0.9481481481481482,1,45.964293363048064,,,0.0,0.0,0,,108.20439012544122,107.1,0.17537454927569437,0.9481481481481482,1,107.59055035661005
44,LEU,7.560688137967588,7.45,0.17537454927569437,0.9481481481481482,1,7.523975034826285,4.392429120562771,4.42,0.17537454927569437,0.9481481481481482,1,4.445526552630703,177.24804520528915,177.31,0.17537454927569437,0.9481481481481482,1,177.34875703883893,54.95047798217893,53.16,0.17537454927569437,0.9481481481481482,1,53.255309683416584,42.618656946126094,41.56,0.17537454927569437,0.9481481481481482,1,41.66352936790432,119.6252061575924,116.4,0.17537454927569437,0.9481481481481482,1,117.36841113297258
45,GLY,7.823394457980907,8.03,0.17537454927569437,0.9481481481481482,1,8.015465195254745,3.988513093226218,,0.0,0.0,0,3.988513093226218,174.5474735501887,173.91,0.17537454927569437,0.9481481481481482,1,174.1601521284882,45.96702942016317,45.46,0.17537454927569437,0.9481481481481482,1,45.490445141808195,,,0.0,0.0,0,,107.87259781344211,106.4,0.17537454927569437,0.9481481481481482,1,106.92639694271284
46,LYS,7.657177757126206,6.85,0.17537454927569437,0.9481481481481482,1,6.961426332922632,4.564633772804973,4.74,0.17537454927569437,0.9481481481481482,1,4.73620708970474,174.62460958389389,174.21,0.17537454927569437,0.9481481481481482,1,174.70818985009436,54.67843224862915,53.86,0.17537454927569437,0.9481481481481482,1,54.035049812598515,34.859772100499505,38.16,0.17537454927569437,0.9481481481481482,1,37.60140426704962,119.66051818621379,116.9,0.17537454927569437,0.9481481481481482,1,117.56284655235321
47,LYS,8.46403358070263,8.45,0.17537454927569437,0.9481481481481482,1,8.443153016017316,4.433428429087579,4.39,0.17537454927569437,0.9481481481481482,1,4.369420943423243,175.37143734975024,176.11,0.17537454927569437,0.9481481481481482,1,176.270109740454,55.19752685723166,54.86,0.17537454927569437,0.9481481481481482,1,54.90401788478189,34.36927447573538,34.76,0.17537454927569437,0.9481481481481482,1,34.76781495824731,120.4990329574703,118.8,0.17537454927569437,0.9481481481481482,1,119.18209942337107
48,ALA,8.534139241319792,8.7,0.17537454927569437,0.9481481481481482,1,8.687729505366855,4.449083155810856,4.31,0.17537454927569437,0.9481481481481482,1,4.31119201971917,176.823487154995,176.61,0.17537454927569437,0.9481481481481482,1,176.802657303996,52.43077717307137,52.26,0.17537454927569437,0.9481481481481482,1,52.35858695973471,19.182928572816074,19.26,0.17537454927569437,0.9481481481481482,1,19.254422293756246,127.54424061414696,128.2,0.17537454927569437,0.9481481481481482,1,128.52240010693197