RESNUM,RESNAME,H_X,H_Y,H_BEST_REF_SCORE,H_BEST_REF_COV,H_BEST_REF_MATCH,H_UCBShift,HA_X,HA_Y,HA_BEST_REF_SCORE,HA_BEST_REF_COV,HA_BEST_REF_MATCH,HA_UCBShift,C_X,C_Y,C_BEST_REF_SCORE,C_BEST_REF_COV,C_BEST_REF_MATCH,C_UCBShift,CA_X,CA_Y,CA_BEST_REF_SCORE,CA_BEST_REF_COV,CA_BEST_REF_MATCH,CA_UCBShift,CB_X,CB_Y,CB_BEST_REF_SCORE,CB_BEST_REF_COV,CB_BEST_REF_MATCH,CB_UCBShift,N_X,N_Y,N_BEST_REF_SCORE,N_BEST_REF_COV,N_BEST_REF_MATCH,N_UCBShift
1,MET,8.359103023326673,,0.0,0.0,0,8.359103023326673,4.404542748423798,,0.0,0.0,0,4.404542748423798,174.70836471946387,,0.0,0.0,0,174.70836471946387,55.12499833578089,,0.0,0.0,0,55.12499833578089,32.990814535192584,,0.0,0.0,0,32.990814535192584,121.38705212569097,,0.0,0.0,0,121.38705212569097
2,VAL,8.212571318270617,,0.0,0.0,0,8.212571318270617,3.980068515318015,,0.0,0.0,0,3.980068515318015,175.4948335898324,,0.0,0.0,0,175.4948335898324,62.046458490076596,,0.0,0.0,0,62.046458490076596,32.72737326771561,,0.0,0.0,0,32.72737326771561,122.09336026172717,,0.0,0.0,0,122.09336026172717
3,ASN,8.489657987484739,,0.0,0.0,0,8.489657987484739,4.678333211921412,,0.0,0.0,0,4.678333211921412,175.91194645623818,,0.0,0.0,0,175.91194645623818,52.470855686469086,,0.0,0.0,0,52.470855686469086,38.65103716238206,,0.0,0.0,0,38.65103716238206,124.53461601127762,,0.0,0.0,0,124.53461601127762
4,PHE,8.437388766566768,,0.0,0.0,0,8.437388766566768,4.440508551043401,,0.0,0.0,0,4.440508551043401,177.04662053938284,,0.0,0.0,0,177.04662053938284,58.88456452267732,,0.0,0.0,0,58.88456452267732,38.87007833841714,,0.0,0.0,0,38.87007833841714,122.26901081202686,,0.0,0.0,0,122.26901081202686
5,LYS,8.194788687584637,,0.0,0.0,0,8.194788687584637,4.22814541959707,,0.0,0.0,0,4.22814541959707,177.17108462894328,,0.0,0.0,0,177.17108462894328,57.60639361211567,,0.0,0.0,0,57.60639361211567,32.31777248043068,,0.0,0.0,0,32.31777248043068,119.37266475725386,,0.0,0.0,0,119.37266475725386
6,ASP,7.941227558452658,,0.0,0.0,0,7.941227558452658,4.6333434525502275,,0.0,0.0,0,4.6333434525502275,176.32957793751805,,0.0,0.0,0,176.32957793751805,55.003387736186035,,0.0,0.0,0,55.003387736186035,41.59895533288933,,0.0,0.0,0,41.59895533288933,118.82515573421578,,0.0,0.0,0,118.82515573421578
7,LYS,7.893162714835164,,0.0,0.0,0,7.893162714835164,4.37278941016761,,0.0,0.0,0,4.37278941016761,176.06225629331777,,0.0,0.0,0,176.06225629331777,55.91243368785659,,0.0,0.0,0,55.91243368785659,32.25710933523143,,0.0,0.0,0,32.25710933523143,121.02671728541459,,0.0,0.0,0,121.02671728541459
8,SER,8.015701396558997,,0.0,0.0,0,8.015701396558997,4.381026090548341,,0.0,0.0,0,4.381026090548341,174.2542697145632,,0.0,0.0,0,174.2542697145632,58.28849497493617,,0.0,0.0,0,58.28849497493617,63.68751396908647,,0.0,0.0,0,63.68751396908647,117.68637638857254,,0.0,0.0,0,117.68637638857254
9,MET,8.465884798451548,,0.0,0.0,0,8.465884798451548,4.6579907092241095,,0.0,0.0,0,4.6579907092241095,174.4600127756854,,0.0,0.0,0,174.4600127756854,53.251362769191914,,0.0,0.0,0,53.251362769191914,32.38937761076146,,0.0,0.0,0,32.38937761076146,123.1544215991786,,0.0,0.0,0,123.1544215991786
10,PRO,,,0.0,0.0,0,,4.451439364180264,,0.0,0.0,0,4.451439364180264,176.6159866428294,,0.0,0.0,0,176.6159866428294,62.79365969527694,,0.0,0.0,0,62.79365969527694,32.026362966211565,,0.0,0.0,0,32.026362966211565,,,0.0,0.0,0,
11,THR,8.564274044477745,8.52,0.6966692888297633,0.8434782608695652,1,8.523617405244755,4.358241781804306,4.19,0.6966692888297633,0.8434782608695652,1,4.222623727428127,175.75235408144079,176.63,0.6966692888297633,0.8434782608695652,1,176.69703783603063,61.09360193321123,63.39,0.6966692888297633,0.8434782608695652,1,63.08431983984904,70.75733210737596,69.59,0.6966692888297633,0.8434782608695652,1,69.89218732758907,113.49350144475524,,0.0,0.0,0,113.49350144475524
12,ALA,9.132596816705517,9.18,0.6966692888297633,0.8434782608695652,1,9.14060423824509,4.009697652114553,3.96,0.6966692888297633,0.8434782608695652,1,3.994060022360973,178.74503129736377,178.53,0.6966692888297633,0.8434782608695652,1,178.66323742395937,56.05666282367077,55.49,0.6966692888297633,0.8434782608695652,1,55.59430078667443,18.512831311183263,19.09,0.6966692888297633,0.8434782608695652,1,19.055573530541682,124.82200115696526,122.02,0.6966692888297633,0.8434782608695652,1,122.42127582706182
13,ILE,7.952560545498946,7.18,0.6966692888297633,0.8434782608695652,1,7.259008682389832,3.5692541133477644,3.52,0.6966692888297633,0.8434782608695652,1,3.5536692264124756,177.75659132591298,177.13,0.6966692888297633,0.8434782608695652,1,177.19128620877456,64.60306123378288,64.69,0.6966692888297633,0.8434782608695652,1,64.91089961606727,37.75674439680874,37.59,0.6966692888297633,0.8434782608695652,1,37.68431564777445,116.60657856578977,114.52,0.6966692888297633,0.8434782608695652,1,114.88529285325785
14,GLU,8.146343481285381,7.41,0.6966692888297633,0.8434782608695652,1,7.496125445970695,4.083590194338995,3.82,0.6966692888297633,0.8434782608695652,1,3.854707616910866,179.36505598040293,178.43,0.6966692888297633,0.8434782608695652,1,178.57807397356532,59.61438782025198,59.59,0.6966692888297633,0.8434782608695652,1,59.60958662649573,29.14624818975469,29.29,0.6966692888297633,0.8434782608695652,1,29.32826960219225,119.56988236338107,119.02,0.6966692888297633,0.8434782608695652,1,119.30942241211567
15,LYS,8.309338542940392,8.02,0.6966692888297633,0.8434782608695652,1,8.08426779077589,4.01725273943279,3.93,0.6966692888297633,0.8434782608695652,1,3.9630571454878454,178.5606486366578,177.73,0.6966692888297633,0.8434782608695652,1,177.85276595352425,57.698647986158285,56.89,0.6966692888297633,0.8434782608695652,1,56.89845963095238,31.40925073665224,30.79,0.6966692888297633,0.8434782608695652,1,30.985471795898547,120.7428850861805,117.62,0.6966692888297633,0.8434782608695652,1,118.05776403450439
16,ALA,8.351434698090799,8.05,0.6966692888297633,0.8434782608695652,1,8.092096274103675,4.188683538378289,4.01,0.6966692888297633,0.8434782608695652,1,4.064769130719281,179.71922502869353,179.63,0.6966692888297633,0.8434782608695652,1,179.64553312248307,55.637675168237315,55.79,0.6966692888297633,0.8434782608695652,1,55.738822248701304,18.357211559928963,18.99,0.6966692888297633,0.8434782608695652,1,19.031717616466867,123.08765877264958,120.82,0.6966692888297633,0.8434782608695652,1,121.25643222731712
17,LEU,8.64809859154179,8.26,0.6966692888297633,0.8434782608695652,1,8.336789825330225,4.210925683832834,4.22,0.6966692888297633,0.8434782608695652,1,4.241741496126096,179.77190558096348,179.73,0.6966692888297633,0.8434782608695652,1,179.75944347984236,58.09921378542568,57.79,0.6966692888297633,0.8434782608695652,1,57.97639462070151,40.911102800338554,40.99,0.6966692888297633,0.8434782608695652,1,41.13064472212787,118.25364937079031,115.72,0.6966692888297633,0.8434782608695652,1,116.08278150929625
18,ASP,8.442899623215673,8.48,0.6966692888297633,0.8434782608695652,1,8.505361691408591,4.508115975774226,4.52,0.6966692888297633,0.8434782608695652,1,4.562563997846598,179.38716934908982,180.53,0.6966692888297633,0.8434782608695652,1,180.3590605580253,57.576806263197916,57.19,0.6966692888297633,0.8434782608695652,1,57.226855213902766,39.99097693432124,39.59,0.6966692888297633,0.8434782608695652,1,39.68316357882118,122.15980607503053,122.72,0.6966692888297633,0.8434782608695652,1,123.11216263461539
19,PHE,8.203474302675103,8.47,0.6966692888297633,0.8434782608695652,1,8.451719420390722,4.51881972055722,4.74,0.6966692888297633,0.8434782608695652,1,4.747710384654234,178.7625637057165,180.63,0.6966692888297633,0.8434782608695652,1,180.2974781587579,60.049099295654344,58.49,0.6966692888297633,0.8434782608695652,1,58.539393980286384,38.36488298146853,38.19,0.6966692888297633,0.8434782608695652,1,38.25646537288267,119.94282187570762,120.02,0.6966692888297633,0.8434782608695652,1,120.41146235940171
20,ILE,8.318685764763014,8.41,0.6966692888297633,0.8434782608695652,1,8.428770312615162,3.6262534101287596,4.0,0.6966692888297633,0.8434782608695652,1,3.883995311371962,178.0011273490898,177.23,0.6966692888297633,0.8434782608695652,1,177.33305235212012,65.73673754650905,64.89,0.6966692888297633,0.8434782608695652,1,65.03945891141636,37.89451552066267,38.09,0.6966692888297633,0.8434782608695652,1,38.176630738972136,119.78828771820402,122.32,0.6966692888297633,0.8434782608695652,1,122.58874053468755
21,GLY,8.944914218537019,8.87,0.6966692888297633,0.8434782608695652,1,8.910627061754912,3.855863883169608,,0.0,0.0,0,3.855863883169608,175.77329654141968,174.83,0.6966692888297633,0.8434782608695652,1,174.90672915581086,46.282615310167614,46.89,0.6966692888297633,0.8434782608695652,1,46.79114651641137,,,0.0,0.0,0,,107.99882742383727,105.52,0.6966692888297633,0.8434782608695652,1,105.93093467218893
22,GLY,8.005055709290708,7.56,0.6966692888297633,0.8434782608695652,1,7.611531910489511,4.033241584121433,,0.0,0.0,0,4.033241584121433,175.0009877903319,175.03,0.6966692888297633,0.8434782608695652,1,174.95430896335887,45.59258533519814,44.99,0.6966692888297633,0.8434782608695652,1,45.04528540457321,,,0.0,0.0,0,,107.49390228001442,106.12,0.6966692888297633,0.8434782608695652,1,106.47894675830281
23,MET,7.566528287395937,,0.0,0.0,0,7.566528287395937,4.3430350184260185,,0.0,0.0,0,4.3430350184260185,175.7641503358586,,0.0,0.0,0,175.7641503358586,54.8710341033411,,0.0,0.0,0,54.8710341033411,33.52720863506494,,0.0,0.0,0,33.52720863506494,119.02886197589078,,0.0,0.0,0,119.02886197589078
24,ASN,8.461176602797202,8.25,0.6966692888297633,0.8434782608695652,1,8.27487600846931,4.597696238578089,4.73,0.6966692888297633,0.8434782608695652,1,4.759134019852371,175.96859182676212,175.93,0.6966692888297633,0.8434782608695652,1,176.03526086290375,52.40333466516817,52.59,0.6966692888297633,0.8434782608695652,1,52.57770081939727,37.19798067924853,36.09,0.6966692888297633,0.8434782608695652,1,36.26589489109224,119.03279735689311,116.92,0.6966692888297633,0.8434782608695652,1,117.22907826154402
25,THR,7.868025262615163,7.33,0.6966692888297633,0.8434782608695652,1,7.56841309910645,3.055659064382839,3.45,0.6966692888297633,0.8434782608695652,1,3.414340076401376,174.17811966650015,173.93,0.6966692888297633,0.8434782608695652,1,174.1149223463703,63.522677863603064,61.79,0.6966692888297633,0.8434782608695652,1,61.93932132233877,67.96362662797758,68.99,0.6966692888297633,0.8434782608695652,1,68.97793122998112,113.67124184871794,113.92,0.6966692888297633,0.8434782608695652,1,114.06257640490065
26,SER,7.725632466505717,7.78,0.6966692888297633,0.8434782608695652,1,7.768404775346876,4.351845177683428,4.52,0.6966692888297633,0.8434782608695652,1,4.542540110750361,174.88017786929737,174.63,0.6966692888297633,0.8434782608695652,1,174.6369890999778,59.2159280061716,58.69,0.6966692888297633,0.8434782608695652,1,58.701552000038845,63.526682948629144,63.93,0.6966692888297633,0.8434782608695652,1,63.9417610521201,115.87646242141747,114.5,0.6966692888297633,0.8434782608695652,1,114.81368446678877
27,ALA,7.666548427283828,7.17,0.6966692888297633,0.8434782608695652,1,7.2312496294594295,4.415340676959152,4.28,0.6966692888297633,0.8434782608695652,1,4.293062496336996,177.23624816539018,176.03,0.6966692888297633,0.8434782608695652,1,176.15210822271618,52.149275608985455,52.29,0.6966692888297633,0.8434782608695652,1,52.26895845623821,19.775291644771897,20.09,0.6966692888297633,0.8434782608695652,1,20.220522880652684,126.76665287708403,,0.0,0.0,0,126.76665287708403
28,SER,8.496776211904763,8.22,0.6966692888297633,0.8434782608695652,1,8.241278103657454,4.514708703219003,4.23,0.6966692888297633,0.8434782608695652,1,4.254163857048507,174.13231717547453,174.13,0.6966692888297633,0.8434782608695652,1,174.22533999975025,60.22108416298701,59.79,0.6966692888297633,0.8434782608695652,1,59.88195377096792,63.76810219597624,63.39,0.6966692888297633,0.8434782608695652,1,63.48013457708402,115.51429040145966,114.52,0.6966692888297633,0.8434782608695652,1,114.90444645910202
29,VAL,7.513825312959263,7.52,0.6966692888297633,0.8434782608695652,1,7.53928567011322,4.409781979956155,4.32,0.6966692888297633,0.8434782608695652,1,4.315306350166501,173.9514386441281,173.63,0.6966692888297633,0.8434782608695652,1,173.7537873935176,59.14662211860362,59.19,0.6966692888297633,0.8434782608695652,1,59.23565018574203,33.442059371278724,33.09,0.6966692888297633,0.8434782608695652,1,33.27534791159396,121.67102860641026,119.52,0.6966692888297633,0.8434782608695652,1,120.05163830696526
30,PRO,,,0.0,0.0,0,,4.516921936385836,4.63,0.6966692888297633,0.8434782608695652,1,4.6299657693917196,176.0696460053391,,0.0,0.0,0,176.0696460053391,62.81473277823843,62.89,0.6966692888297633,0.8434782608695652,1,62.847977613603064,32.242619846786546,31.79,0.6966692888297633,0.8434782608695652,1,31.876244974214675,,,0.0,0.0,0,
31,HIS,8.878419704673105,9.38,0.6966692888297633,0.8434782608695652,1,9.339250385420137,4.466200311316461,4.55,0.6966692888297633,0.8434782608695652,1,4.567514063769563,176.83148713513154,,0.0,0.0,0,176.83148713513154,56.07525120927961,56.19,0.6966692888297633,0.8434782608695652,1,56.010111858846706,31.38505621148296,30.49,0.6966692888297633,0.8434782608695652,1,30.36913146004551,119.58876668625264,,0.0,0.0,0,119.58876668625264
32,SER,8.956212556399157,8.8,0.6966692888297633,0.8434782608695652,1,8.794534008891109,4.096784471811522,4.24,0.6966692888297633,0.8434782608695652,1,4.247634291491841,176.27809461182704,,0.0,0.0,0,176.27809461182704,61.48440951934732,61.69,0.6966692888297633,0.8434782608695652,1,61.730370328021976,62.95120451544567,63.19,0.6966692888297633,0.8434782608695652,1,63.13808652653457,117.43963266459096,,0.0,0.0,0,117.43963266459096
33,MET,8.429853624242423,,0.0,0.0,0,8.429853624242423,3.6636743283605293,,0.0,0.0,0,3.6636743283605293,177.24490607373738,,0.0,0.0,0,177.24490607373738,58.50545443533133,,0.0,0.0,0,58.50545443533133,32.62454934063714,,0.0,0.0,0,32.62454934063714,121.38812642753912,,0.0,0.0,0,121.38812642753912
34,ASP,8.20343707043512,7.36,0.6966692888297633,0.8434782608695652,1,7.4271984260406265,4.463139198329449,4.6,0.6966692888297633,0.8434782608695652,1,4.588841037695638,178.52870034116995,177.13,0.6966692888297633,0.8434782608695652,1,177.44209835466756,57.36082066740482,56.69,0.6966692888297633,0.8434782608695652,1,56.78604249799645,40.595583036180486,40.59,0.6966692888297633,0.8434782608695652,1,40.66332971992452,120.43407164386724,122.52,0.6966692888297633,0.8434782608695652,1,122.79826311846487
35,GLU,8.966854861532912,8.71,0.6966692888297633,0.8434782608695652,1,8.75973045958486,3.7641612522782784,3.72,0.6966692888297633,0.8434782608695652,1,3.7285962995892996,177.97392668699632,178.03,0.6966692888297633,0.8434782608695652,1,178.07140058656344,59.589006419003226,59.29,0.6966692888297633,0.8434782608695652,1,59.01797456521257,29.872433287029637,28.79,0.6966692888297633,0.8434782608695652,1,28.907756314657565,120.40051021026751,120.52,0.6966692888297633,0.8434782608695652,1,121.27545853398269
36,SER,8.138759805749807,8.11,0.6966692888297633,0.8434782608695652,1,8.110391586297037,4.026323440731491,4.0,0.6966692888297633,0.8434782608695652,1,4.037180478693529,176.75796590796426,176.53,0.6966692888297633,0.8434782608695652,1,176.60459947575757,62.321236617460315,63.19,0.6966692888297633,0.8434782608695652,1,63.04667864805195,62.87730071646131,63.19,0.6966692888297633,0.8434782608695652,1,63.287067594555445,114.55929877436452,113.02,0.6966692888297633,0.8434782608695652,1,113.42978502908203
37,THR,8.677155294605395,8.09,0.6966692888297633,0.8434782608695652,1,8.183658346842048,3.926749524503274,3.66,0.6966692888297633,0.8434782608695652,1,3.7130413572816066,176.02420126868685,175.33,0.6966692888297633,0.8434782608695652,1,175.47852790177598,66.50978023260073,67.79,0.6966692888297633,0.8434782608695652,1,67.85420065752027,68.48426014887889,67.99,0.6966692888297633,0.8434782608695652,1,68.06231504044844,120.04397564309579,119.12,0.6966692888297633,0.8434782608695652,1,119.37176525548341
38,ALA,8.887836746053946,9.1,0.6966692888297633,0.8434782608695652,1,9.096957917171718,3.892625981512931,3.85,0.6966692888297633,0.8434782608695652,1,3.8741678872294374,178.90813517036298,179.13,0.6966692888297633,0.8434782608695652,1,179.1099760972361,55.481071167404814,55.69,0.6966692888297633,0.8434782608695652,1,55.608780163070264,18.548385043928295,17.89,0.6966692888297633,0.8434782608695652,1,17.95177345838606,124.70568427477522,122.72,0.6966692888297633,0.8434782608695652,1,123.1866244062826
39,LYS,8.215610435742034,8.09,0.6966692888297633,0.8434782608695652,1,8.10171309132534,3.6626397317210566,3.55,0.6966692888297633,0.8434782608695652,1,3.579344478887778,178.74592282044622,177.83,0.6966692888297633,0.8434782608695652,1,177.95882162264957,60.659922566477974,61.09,0.6966692888297633,0.8434782608695652,1,61.15643725256965,32.21322356535132,33.99,0.6966692888297633,0.8434782608695652,1,33.78639178397159,116.45393793752915,114.62,0.6966692888297633,0.8434782608695652,1,114.979488099223
40,GLY,8.101103088772339,7.89,0.6966692888297633,0.8434782608695652,1,7.988784210844711,3.5184771190698187,,0.0,0.0,0,3.5184771190698187,175.14452809824064,175.53,0.6966692888297633,0.8434782608695652,1,175.56159451960264,47.04340918636364,46.99,0.6966692888297633,0.8434782608695652,1,46.894294376651125,,,0.0,0.0,0,,108.2307628573815,105.72,0.6966692888297633,0.8434782608695652,1,106.39948143770118
41,ILE,8.518554940442892,7.99,0.6966692888297633,0.8434782608695652,1,8.097551419436119,3.272799597177822,3.07,0.6966692888297633,0.8434782608695652,1,2.968576974930626,177.83083584166388,176.83,0.6966692888297633,0.8434782608695652,1,177.05295818403263,65.60425878622488,65.49,0.6966692888297633,0.8434782608695652,1,65.5280395622544,37.93165450948496,38.69,0.6966692888297633,0.8434782608695652,1,38.69143007864358,122.56155601860918,122.62,0.6966692888297633,0.8434782608695652,1,122.7741547361694
42,LEU,8.377800172560773,7.98,0.6966692888297633,0.8434782608695652,1,8.0665295503996,3.905292487884338,4.0,0.6966692888297633,0.8434782608695652,1,3.9784890877233883,178.78567941943055,180.43,0.6966692888297633,0.8434782608695652,1,180.37861309769673,58.06933622609058,57.79,0.6966692888297633,0.8434782608695652,1,57.563160024458874,41.64772086630592,42.19,0.6966692888297633,0.8434782608695652,1,42.25179385800866,118.78442108413807,116.72,0.6966692888297633,0.8434782608695652,1,117.14471832926517
43,LYS,8.293590222027971,8.75,0.6966692888297633,0.8434782608695652,1,8.782094714496614,3.848804682140082,3.92,0.6966692888297633,0.8434782608695652,1,3.9231986619380614,178.14417878939392,176.83,0.6966692888297633,0.8434782608695652,1,177.25756130733708,60.11313346475747,59.49,0.6966692888297633,0.8434782608695652,1,59.537754142629595,32.34790576824287,32.79,0.6966692888297633,0.8434782608695652,1,32.89883449040404,120.13591647908203,121.22,0.6966692888297633,0.8434782608695652,1,121.40775924931735
44,TYR,8.51912852057387,8.35,0.6966692888297633,0.8434782608695652,1,8.390629317904317,4.297852386041736,4.35,0.6966692888297633,0.8434782608695652,1,4.350380586946387,178.08743961311467,178.03,0.6966692888297633,0.8434782608695652,1,178.06698422816075,62.128393327089576,61.69,0.6966692888297633,0.8434782608695652,1,61.72068227264403,39.06966398967699,40.09,0.6966692888297633,0.8434782608695652,1,40.08102607389277,121.29001142715062,120.42,0.6966692888297633,0.8434782608695652,1,120.61714513317793
45,LEU,8.854352462404263,8.08,0.6966692888297633,0.8434782608695652,1,8.20741805984016,3.8091549731129986,3.82,0.6966692888297633,0.8434782608695652,1,3.8213631729104227,178.99952796280385,179.33,0.6966692888297633,0.8434782608695652,1,179.29585803528138,57.91031992155622,57.99,0.6966692888297633,0.8434782608695652,1,58.020284012126766,40.97008555127095,39.39,0.6966692888297633,0.8434782608695652,1,39.57126742378178,118.7746147526862,115.82,0.6966692888297633,0.8434782608695652,1,116.41872411994672
46,HIS,8.254521223232324,7.8,0.6966692888297633,0.8434782608695652,1,7.858333352863803,3.9786995097402595,3.76,0.6966692888297633,0.8434782608695652,1,3.804695560939061,178.68224699074813,178.83,0.6966692888297633,0.8434782608695652,1,178.7719019448274,60.78841151012321,60.79,0.6966692888297633,0.8434782608695652,1,60.65203149414475,28.75668262890443,28.59,0.6966692888297633,0.8434782608695652,1,28.672683072866022,118.53913788228438,117.42,0.6966692888297633,0.8434782608695652,1,117.86651709872905
47,ASP,8.390116077605727,9.0,0.6966692888297633,0.8434782608695652,1,8.96704543983239,4.38195762962038,4.28,0.6966692888297633,0.8434782608695652,1,4.2863247046342545,178.11817107175048,177.83,0.6966692888297633,0.8434782608695652,1,177.86365191522367,56.9623311951493,56.99,0.6966692888297633,0.8434782608695652,1,57.01696530934621,39.977519993467645,39.29,0.6966692888297633,0.8434782608695652,1,39.378319776584526,122.54815693336108,123.02,0.6966692888297633,0.8434782608695652,1,123.37106724481075
48,LEU,7.582628294916194,7.61,0.6966692888297633,0.8434782608695652,1,7.612943988178488,4.232519102977578,4.21,0.6966692888297633,0.8434782608695652,1,4.209588975374626,177.0360579277167,176.93,0.6966692888297633,0.8434782608695652,1,177.0227502479576,54.87763762676213,55.09,0.6966692888297633,0.8434782608695652,1,55.05455828842269,42.687480494910645,42.59,0.6966692888297633,0.8434782608695652,1,42.69885666901432,118.56238297526917,119.02,0.6966692888297633,0.8434782608695652,1,119.22242577323787
49,GLY,7.773712222299922,7.73,0.6966692888297633,0.8434782608695652,1,7.760019730730381,3.9345279870018866,,0.0,0.0,0,3.9345279870018866,174.24093695243644,174.03,0.6966692888297633,0.8434782608695652,1,174.12762294413366,45.43327709851815,45.19,0.6966692888297633,0.8434782608695652,1,45.10755719178599,,,0.0,0.0,0,,107.13680317560217,106.12,0.6966692888297633,0.8434782608695652,1,106.51493859025419
50,VAL,8.081868621983572,8.09,0.6966692888297633,0.8434782608695652,1,8.118008784471083,4.483918494125319,4.37,0.6966692888297633,0.8434782608695652,1,4.399496976995227,174.7809968616772,179.43,0.6966692888297633,0.8434782608695652,1,178.98377799221336,58.86055796017871,58.59,0.6966692888297633,0.8434782608695652,1,58.59504183141303,32.482992626640026,32.19,0.6966692888297633,0.8434782608695652,1,32.29828182164503,121.81370907039071,119.62,0.6966692888297633,0.8434782608695652,1,120.13754238442668
51,PRO,,,0.0,0.0,0,,4.420323048934399,4.35,0.6966692888297633,0.8434782608695652,1,4.368670732595183,176.14845786582862,177.43,0.6966692888297633,0.8434782608695652,1,177.36872947819958,62.904857210822506,62.29,0.6966692888297633,0.8434782608695652,1,62.28828278755134,32.12080889558775,32.59,0.6966692888297633,0.8434782608695652,1,32.6112448421412,,,0.0,0.0,0,
52,VAL,8.462803123176823,8.83,0.6966692888297633,0.8434782608695652,1,8.871855063392163,4.040837625915751,3.83,0.6966692888297633,0.8434782608695652,1,3.8638721310467306,175.08117048367745,175.13,0.6966692888297633,0.8434782608695652,1,175.13361449131426,62.71007234714175,61.09,0.6966692888297633,0.8434782608695652,1,61.0905389491897,32.331712304911754,32.79,0.6966692888297633,0.8434782608695652,1,32.813655371250974,122.1597673346154,122.02,0.6966692888297633,0.8434782608695652,1,122.30449621960817
53,SER,8.359597206610056,8.53,0.6966692888297633,0.8434782608695652,1,8.570804487057387,4.699085497804973,4.74,0.6966692888297633,0.8434782608695652,1,4.751197338100789,173.6617312509546,173.63,0.6966692888297633,0.8434782608695652,1,173.72374581328117,56.23663155964591,56.09,0.6966692888297633,0.8434782608695652,1,56.05444517723943,63.20151439381729,63.19,0.6966692888297633,0.8434782608695652,1,63.23832498332223,123.7226824466367,124.32,0.6966692888297633,0.8434782608695652,1,124.97124377271616
54,PRO,,,0.0,0.0,0,,4.1237040795177045,4.02,0.6966692888297633,0.8434782608695652,1,4.037444571406372,178.20080482536352,177.83,0.6966692888297633,0.8434782608695652,1,177.90859515019426,65.66611033299478,65.69,0.6966692888297633,0.8434782608695652,1,65.65998751522366,31.666152087529138,31.49,0.6966692888297633,0.8434782608695652,1,31.574565577228327,,,0.0,0.0,0,