RESNUM,RESNAME,H_X,H_Y,H_BEST_REF_SCORE,H_BEST_REF_COV,H_BEST_REF_MATCH,H_UCBShift,HA_X,HA_Y,HA_BEST_REF_SCORE,HA_BEST_REF_COV,HA_BEST_REF_MATCH,HA_UCBShift,C_X,C_Y,C_BEST_REF_SCORE,C_BEST_REF_COV,C_BEST_REF_MATCH,C_UCBShift,CA_X,CA_Y,CA_BEST_REF_SCORE,CA_BEST_REF_COV,CA_BEST_REF_MATCH,CA_UCBShift,CB_X,CB_Y,CB_BEST_REF_SCORE,CB_BEST_REF_COV,CB_BEST_REF_MATCH,CB_UCBShift,N_X,N_Y,N_BEST_REF_SCORE,N_BEST_REF_COV,N_BEST_REF_MATCH,N_UCBShift
1,MET,8.34352996891442,,0,0,0,8.34352996891442,4.436150257314908,,0,0,0,4.436150257314908,175.24501600038852,,0,0,0,175.24501600038852,55.330939916788765,,0,0,0,55.330939916788765,32.68605035506715,,0,0,0,32.68605035506715,121.11295373069707,,0,0,0,121.11295373069707
2,LYS,8.338618602736151,,0,0,0,8.338618602736151,4.4949714725885235,,0,0,0,4.4949714725885235,176.72735038917747,,0,0,0,176.72735038917747,56.19951538889444,,0,0,0,56.19951538889444,32.795368962432015,,0,0,0,32.795368962432015,122.34594320618271,,0,0,0,122.34594320618271
3,ARG,8.194472764657565,,0,0,0,8.194472764657565,4.307293627297702,,0,0,0,4.307293627297702,177.44784643450996,,0,0,0,177.44784643450996,57.42794023998779,,0,0,0,57.42794023998779,30.458031066477965,,0,0,0,30.458031066477965,120.80603727923187,,0,0,0,120.80603727923187
4,GLN,8.469370241042292,,0,0,0,8.469370241042292,4.06254299610112,,0,0,0,4.06254299610112,177.35955114868466,,0,0,0,177.35955114868466,58.884247204700856,,0,0,0,58.884247204700856,28.516300056310357,,0,0,0,28.516300056310357,119.57986677613498,,0,0,0,119.57986677613498
5,LYS,8.223349863258962,,0,0,0,8.223349863258962,4.077640712468088,,0,0,0,4.077640712468088,178.26214273062493,,0,0,0,178.26214273062493,58.312352781462984,,0,0,0,58.312352781462984,32.4535344981241,,0,0,0,32.4535344981241,118.49425927824399,,0,0,0,118.49425927824399
6,ARG,8.041659736341437,,0,0,0,8.041659736341437,4.006458384035409,,0,0,0,4.006458384035409,177.88879109002664,,0,0,0,177.88879109002664,58.17258523927184,,0,0,0,58.17258523927184,29.82500693130203,,0,0,0,29.82500693130203,120.42397784576535,,0,0,0,120.42397784576535
7,ASP,8.321187347963148,,0,0,0,8.321187347963148,4.423069025133199,,0,0,0,4.423069025133199,178.81133875318017,,0,0,0,178.81133875318017,56.932167622755024,,0,0,0,56.932167622755024,40.19004626216007,,0,0,0,40.19004626216007,119.67017758615829,,0,0,0,119.67017758615829
8,ARG,7.640508981501831,,0,0,0,7.640508981501831,4.130423769669219,,0,0,0,4.130423769669219,178.72544836250972,,0,0,0,178.72544836250972,58.77718215666555,,0,0,0,58.77718215666555,30.266124893756242,,0,0,0,30.266124893756242,119.97139671999668,,0,0,0,119.97139671999668
9,LEU,7.904847571095571,,0,0,0,7.904847571095571,3.749837743217893,,0,0,0,3.749837743217893,178.8775621415085,,0,0,0,178.8775621415085,57.17265786676102,,0,0,0,57.17265786676102,40.557701006837604,,0,0,0,40.557701006837604,120.54400224533799,,0,0,0,120.54400224533799
10,GLU,8.605468043151292,,0,0,0,8.605468043151292,3.9318764992840496,,0,0,0,3.9318764992840496,178.63907461749915,,0,0,0,178.63907461749915,59.73020537864358,,0,0,0,59.73020537864358,29.155507346864248,,0,0,0,29.155507346864248,120.66642682411478,,0,0,0,120.66642682411478
11,ARG,8.147503141858142,,0,0,0,8.147503141858142,4.124461825002775,,0,0,0,4.124461825002775,178.87574687450328,,0,0,0,178.87574687450328,59.250158901065596,,0,0,0,59.250158901065596,30.12445341884227,,0,0,0,30.12445341884227,119.8495327037962,,0,0,0,119.8495327037962
12,ALA,8.282660948551449,,0,0,0,8.282660948551449,4.114444733516484,,0,0,0,4.114444733516484,179.18902421686093,,0,0,0,179.18902421686093,54.932534246620044,,0,0,0,54.932534246620044,17.792588330919084,,0,0,0,17.792588330919084,123.28934919398934,,0,0,0,123.28934919398934
13,GLN,8.871450908658009,,0,0,0,8.871450908658009,4.312924516799867,,0,0,0,4.312924516799867,178.47484713339992,,0,0,0,178.47484713339992,59.08303001959152,,0,0,0,59.08303001959152,28.46739361983017,,0,0,0,28.46739361983017,119.73342224375624,,0,0,0,119.73342224375624
14,SER,8.397506952186703,,0,0,0,8.397506952186703,4.245151981129981,,0,0,0,4.245151981129981,177.11533201164391,,0,0,0,177.11533201164391,61.71401329441114,,0,0,0,61.71401329441114,63.16290300767565,,0,0,0,63.16290300767565,115.49051601451326,,0,0,0,115.49051601451326
15,GLN,8.464902581324232,,0,0,0,8.464902581324232,4.32727559563492,,0,0,0,4.32727559563492,178.39206638333889,,0,0,0,178.39206638333889,57.8406333447386,,0,0,0,57.8406333447386,28.52346970002775,,0,0,0,28.52346970002775,122.33139805724275,,0,0,0,122.33139805724275
16,GLY,8.685076428493728,,0,0,0,8.685076428493728,3.4862444380591624,,0,0,0,3.4862444380591624,175.1299201079143,,0,0,0,175.1299201079143,46.6592525957265,,0,0,0,46.6592525957265,,,0,0,0,,109.49024392964257,,0,0,0,109.49024392964257
17,TYR,8.704754134670884,,0,0,0,8.704754134670884,3.9867276561993563,,0,0,0,3.9867276561993563,177.68087215698745,,0,0,0,177.68087215698745,61.762619867582416,,0,0,0,61.762619867582416,38.7348249056943,,0,0,0,38.7348249056943,123.09070370672106,,0,0,0,123.09070370672106
18,LYS,8.237524899733598,,0,0,0,8.237524899733598,3.9454267808108554,,0,0,0,3.9454267808108554,178.93232945858585,,0,0,0,178.93232945858585,59.79416829226884,,0,0,0,59.79416829226884,32.51953790825841,,0,0,0,32.51953790825841,117.9835473929515,,0,0,0,117.9835473929515
19,ALA,8.081737848101898,,0,0,0,8.081737848101898,4.235860553907204,,0,0,0,4.235860553907204,180.10808911626154,,0,0,0,180.10808911626154,54.874042819530466,,0,0,0,54.874042819530466,18.11051552625153,,0,0,0,18.11051552625153,123.45232891390276,,0,0,0,123.45232891390276
20,GLY,8.680042702319902,,0,0,0,8.680042702319902,3.358668081529581,,0,0,0,3.358668081529581,175.8319598068154,,0,0,0,175.8319598068154,46.91878606986347,,0,0,0,46.91878606986347,,,0,0,0,,108.61076026410257,,0,0,0,108.61076026410257
21,LEU,8.368212767493617,,0,0,0,8.368212767493617,3.78873472022977,,0,0,0,3.78873472022977,179.1076073030414,,0,0,0,179.1076073030414,57.153880453313356,,0,0,0,57.153880453313356,41.65022754049839,,0,0,0,41.65022754049839,122.22653457762793,,0,0,0,122.22653457762793
22,ASN,8.258541934254636,,0,0,0,8.258541934254636,4.609724533993784,,0,0,0,4.609724533993784,175.80580868613052,,0,0,0,175.80580868613052,54.07207829201909,,0,0,0,54.07207829201909,38.53758910949606,,0,0,0,38.53758910949606,116.50203479440005,,0,0,0,116.50203479440005
23,GLY,7.9668237329004326,,0,0,0,7.9668237329004326,3.9468453926379174,,0,0,0,3.9468453926379174,174.9113318501887,,0,0,0,174.9113318501887,46.11507384148629,,0,0,0,46.11507384148629,,,0,0,0,,108.51302972816073,,0,0,0,108.51302972816073
24,ARG,8.115251341330891,,0,0,0,8.115251341330891,4.469499195898546,,0,0,0,4.469499195898546,176.04382890426797,,0,0,0,176.04382890426797,56.001783743856144,,0,0,0,56.001783743856144,31.924742697241648,,0,0,0,31.924742697241648,120.51316353847818,,0,0,0,120.51316353847818
25,SER,8.778806552319903,,0,0,0,8.778806552319903,4.581612672910422,,0,0,0,4.581612672910422,175.69314784412254,,0,0,0,175.69314784412254,58.04410817612943,,0,0,0,58.04410817612943,64.40912764967254,,0,0,0,64.40912764967254,117.45370367327118,,0,0,0,117.45370367327118
26,GLN,8.763992005683205,,0,0,0,8.763992005683205,3.946297653268953,,0,0,0,3.946297653268953,177.6182218487568,,0,0,0,177.6182218487568,58.026432303929404,,0,0,0,58.026432303929404,28.110817408030858,,0,0,0,28.110817408030858,121.43160271552337,,0,0,0,121.43160271552337
27,GLU,8.840336917210568,,0,0,0,8.840336917210568,4.109782793603619,,0,0,0,4.109782793603619,176.77866278575314,,0,0,0,176.77866278575314,57.89466861311466,,0,0,0,57.89466861311466,28.869521037506935,,0,0,0,28.869521037506935,117.73243073418249,,0,0,0,117.73243073418249
28,ALA,7.7371988780996785,,0,0,0,7.7371988780996785,4.293260638511489,,0,0,0,4.293260638511489,176.87695134839052,,0,0,0,176.87695134839052,52.26309543997669,,0,0,0,52.26309543997669,19.442571592013543,,0,0,0,19.442571592013543,121.58407940626596,,0,0,0,121.58407940626596
29,CYS,7.29786962978688,,0,0,0,7.29786962978688,3.5377905881340883,,0,0,0,3.5377905881340883,173.56947455581084,,0,0,0,173.56947455581084,56.68797556758241,,0,0,0,56.68797556758241,26.991477014874018,,0,0,0,26.991477014874018,119.38051266847042,,0,0,0,119.38051266847042
30,PRO,,,0,0,0,,4.408680518931069,,0,0,0,4.408680518931069,175.8731110955378,,0,0,0,175.8731110955378,63.29993248147408,,0,0,0,63.29993248147408,31.504219774186925,,0,0,0,31.504219774186925,,,0,0,0,
31,TYR,6.790503186186035,,0,0,0,6.790503186186035,4.563307060805861,,0,0,0,4.563307060805861,175.9657082863026,,0,0,0,175.9657082863026,58.15160276475746,,0,0,0,58.15160276475746,38.38734824931735,,0,0,0,38.38734824931735,120.0683239539405,,0,0,0,120.0683239539405
32,GLN,8.544858175635476,,0,0,0,8.544858175635476,4.248755926623377,,0,0,0,4.248755926623377,175.81245441583417,,0,0,0,175.81245441583417,56.097466234287936,,0,0,0,56.097466234287936,29.208889616971916,,0,0,0,29.208889616971916,121.65381741711066,,0,0,0,121.65381741711066
33,GLN,8.14916896985237,,0,0,0,8.14916896985237,4.418275256393606,,0,0,0,4.418275256393606,176.67887107138972,,0,0,0,176.67887107138972,55.27925320950716,,0,0,0,55.27925320950716,29.427213973287824,,0,0,0,29.427213973287824,119.64998199753579,,0,0,0,119.64998199753579
34,VAL,8.584775453729602,,0,0,0,8.584775453729602,3.8461115746919745,,0,0,0,3.8461115746919745,177.22262110410145,,0,0,0,177.22262110410145,65.56293848403818,,0,0,0,65.56293848403818,31.840115904706405,,0,0,0,31.840115904706405,123.08074468771228,,0,0,0,123.08074468771228
35,ASP,8.717805223082472,,0,0,0,8.717805223082472,4.623278578865579,,0,0,0,4.623278578865579,178.5331864436064,,0,0,0,178.5331864436064,57.12481973124098,,0,0,0,57.12481973124098,40.12573347228327,,0,0,0,40.12573347228327,121.03377246245422,,0,0,0,121.03377246245422
36,ALA,8.012820531296482,,0,0,0,8.012820531296482,3.9377109651515156,,0,0,0,3.9377109651515156,179.14208005378512,,0,0,0,179.14208005378512,54.646135452675104,,0,0,0,54.646135452675104,18.239764061283164,,0,0,0,18.239764061283164,123.18038247596293,,0,0,0,123.18038247596293
37,ARG,8.547075042479744,,0,0,0,8.547075042479744,3.8797115207597956,,0,0,0,3.8797115207597956,178.48988166910868,,0,0,0,178.48988166910868,59.98576040951826,,0,0,0,59.98576040951826,30.02797066339216,,0,0,0,30.02797066339216,120.2501365505772,,0,0,0,120.2501365505772
38,SER,8.422109374281275,,0,0,0,8.422109374281275,4.252491773626374,,0,0,0,4.252491773626374,177.2000527590687,,0,0,0,177.2000527590687,61.85369028192918,,0,0,0,61.85369028192918,62.94150863140193,,0,0,0,62.94150863140193,115.50727692064602,,0,0,0,115.50727692064602
39,TYR,8.38790156042291,,0,0,0,8.38790156042291,4.169373514049839,,0,0,0,4.169373514049839,178.24295257542457,,0,0,0,178.24295257542457,61.280297507270504,,0,0,0,61.280297507270504,38.18586678924964,,0,0,0,38.18586678924964,122.76679234417249,,0,0,0,122.76679234417249
40,TRP,8.76422256065601,,0,0,0,8.76422256065601,4.253058144688644,,0,0,0,4.253058144688644,178.88488058788434,,0,0,0,178.88488058788434,62.614629171617274,,0,0,0,62.614629171617274,29.487140003180155,,0,0,0,29.487140003180155,123.53500583599732,,0,0,0,123.53500583599732
41,LEU,8.982668726423576,,0,0,0,8.982668726423576,4.095993930297481,,0,0,0,4.095993930297481,179.4123738639416,,0,0,0,179.4123738639416,57.608213943423245,,0,0,0,57.608213943423245,41.726832276584524,,0,0,0,41.726832276584524,119.09334867809413,,0,0,0,119.09334867809413
42,GLY,8.440538751043402,,0,0,0,8.440538751043402,3.9255781135253636,,0,0,0,3.9255781135253636,176.22459248201244,,0,0,0,176.22459248201244,47.32934519297925,,0,0,0,47.32934519297925,,,0,0,0,,107.74091482890442,,0,0,0,107.74091482890442
43,GLY,8.365792211444111,,0,0,0,8.365792211444111,3.833097471281497,,0,0,0,3.833097471281497,176.1957899020868,,0,0,0,176.1957899020868,47.27385983227883,,0,0,0,47.27385983227883,,,0,0,0,,109.34625305722055,,0,0,0,109.34625305722055
44,TRP,8.825880376462427,,0,0,0,8.825880376462427,4.05158988430736,,0,0,0,4.05158988430736,178.87256661955266,,0,0,0,178.87256661955266,62.05654202231658,,0,0,0,62.05654202231658,29.411179224597625,,0,0,0,29.411179224597625,124.79187919342324,,0,0,0,124.79187919342324
45,ARG,8.442917476040627,,0,0,0,8.442917476040627,3.7978573624209124,,0,0,0,3.7978573624209124,178.30079585893552,,0,0,0,178.30079585893552,59.39266954809634,,0,0,0,59.39266954809634,30.0111204500555,,0,0,0,30.0111204500555,119.62838436966366,,0,0,0,119.62838436966366
46,ASP,8.188848993434343,,0,0,0,8.188848993434343,4.490803572327672,,0,0,0,4.490803572327672,178.3953761281885,,0,0,0,178.3953761281885,56.98798253557554,,0,0,0,56.98798253557554,41.27746946909757,,0,0,0,41.27746946909757,120.43362948480409,,0,0,0,120.43362948480409
47,ALA,8.256782695077145,,0,0,0,8.256782695077145,3.299482878021979,,0,0,0,3.299482878021979,178.97674011132202,,0,0,0,178.97674011132202,54.928532001065605,,0,0,0,54.928532001065605,17.47024012904873,,0,0,0,17.47024012904873,121.65724434108114,,0,0,0,121.65724434108114
48,ARG,7.884815511421912,,0,0,0,7.884815511421912,3.7275305637112885,,0,0,0,3.7275305637112885,178.76961870830837,,0,0,0,178.76961870830837,59.42031079096459,,0,0,0,59.42031079096459,29.68982333997114,,0,0,0,29.68982333997114,118.90413662545788,,0,0,0,118.90413662545788
49,ASP,8.29503538023088,,0,0,0,8.29503538023088,4.400687971353646,,0,0,0,4.400687971353646,178.24308935738708,,0,0,0,178.24308935738708,56.802511764257964,,0,0,0,56.802511764257964,40.96278357340992,,0,0,0,40.96278357340992,120.8504858436397,,0,0,0,120.8504858436397
50,GLU,8.309486802747253,,0,0,0,8.309486802747253,3.916554191722166,,0,0,0,3.916554191722166,178.5750831461927,,0,0,0,178.5750831461927,58.62927672691753,,0,0,0,58.62927672691753,29.552110923887223,,0,0,0,29.552110923887223,120.47610098363859,,0,0,0,120.47610098363859
51,LYS,8.189701215645465,,0,0,0,8.189701215645465,3.842385805155955,,0,0,0,3.842385805155955,177.88419762988678,,0,0,0,177.88419762988678,59.04252168008103,,0,0,0,59.04252168008103,32.21632101974692,,0,0,0,32.21632101974692,120.31939374995561,,0,0,0,120.31939374995561
52,GLN,8.260653313963815,,0,0,0,8.260653313963815,3.9989102749139747,,0,0,0,3.9989102749139747,177.97945687011878,,0,0,0,177.97945687011878,57.93798480757576,,0,0,0,57.93798480757576,28.454201376501274,,0,0,0,28.454201376501274,119.16850620321345,,0,0,0,119.16850620321345
53,SER,8.294597084615384,,0,0,0,8.294597084615384,3.4820616727605724,,0,0,0,3.4820616727605724,176.11103639875125,,0,0,0,176.11103639875125,60.77274848563103,,0,0,0,60.77274848563103,62.78047283866134,,0,0,0,62.78047283866134,116.50845438592519,,0,0,0,116.50845438592519
54,GLY,8.210251268276169,,0,0,0,8.210251268276169,3.8173402614357865,,0,0,0,3.8173402614357865,176.11045009289046,,0,0,0,176.11045009289046,46.53398038076368,,0,0,0,46.53398038076368,,,0,0,0,,109.79263982988678,,0,0,0,109.79263982988678
55,LEU,7.6438537700743705,,0,0,0,7.6438537700743705,4.088755180969031,,0,0,0,4.088755180969031,178.8745546567377,,0,0,0,178.8745546567377,57.303842196203796,,0,0,0,57.303842196203796,42.018761596803195,,0,0,0,42.018761596803195,122.18977988827838,,0,0,0,122.18977988827838
56,TYR,8.184000952947052,,0,0,0,8.184000952947052,4.376931547960373,,0,0,0,4.376931547960373,177.70730723229548,,0,0,0,177.70730723229548,60.092635264729715,,0,0,0,60.092635264729715,37.94830023263958,,0,0,0,37.94830023263958,118.11561817749472,,0,0,0,118.11561817749472
57,LYS,8.039190216849816,,0,0,0,8.039190216849816,4.091398422605173,,0,0,0,4.091398422605173,177.91660882840492,,0,0,0,177.91660882840492,58.39706056684427,,0,0,0,58.39706056684427,32.4270550493562,,0,0,0,32.4270550493562,120.7268521447497,,0,0,0,120.7268521447497
58,LEU,7.6550710211732715,,0,0,0,7.6550710211732715,4.287593620795871,,0,0,0,4.287593620795871,178.4800447005994,,0,0,0,178.4800447005994,56.43360663502053,,0,0,0,56.43360663502053,42.62683541325896,,0,0,0,42.62683541325896,118.34314990197579,,0,0,0,118.34314990197579
59,GLU,7.860541005022755,,0,0,0,7.860541005022755,4.345666126351426,,0,0,0,4.345666126351426,177.3474543156843,,0,0,0,177.3474543156843,57.46484483572539,,0,0,0,57.46484483572539,30.384983136790986,,0,0,0,30.384983136790986,118.04328380917416,,0,0,0,118.04328380917416
60,HIS,7.882712980907981,,0,0,0,7.882712980907981,4.572289038750139,,0,0,0,4.572289038750139,175.0993890000999,,0,0,0,175.0993890000999,56.84384250470085,,0,0,0,56.84384250470085,29.369184956243757,,0,0,0,29.369184956243757,117.77332512505828,,0,0,0,117.77332512505828
61,HIS,8.301262529415029,,0,0,0,8.301262529415029,4.706550447302697,,0,0,0,4.706550447302697,174.41147608534243,,0,0,0,174.41147608534243,55.90560957504717,,0,0,0,55.90560957504717,29.426982824175823,,0,0,0,29.426982824175823,117.82904156824287,,0,0,0,117.82904156824287
62,HIS,8.087497885669887,,0,0,0,8.087497885669887,4.584742211161061,,0,0,0,4.584742211161061,173.99978861354202,,0,0,0,173.99978861354202,55.604951527222774,,0,0,0,55.604951527222774,29.09978106089466,,0,0,0,29.09978106089466,118.59012355369076,,0,0,0,118.59012355369076
63,HIS,8.277674504295705,,0,0,0,8.277674504295705,4.453727154123654,,0,0,0,4.453727154123654,174.13696699900655,,0,0,0,174.13696699900655,55.37938743514818,,0,0,0,55.37938743514818,30.077030155516706,,0,0,0,30.077030155516706,119.50302006428572,,0,0,0,119.50302006428572
64,HIS,8.470121826096126,,0,0,0,8.470121826096126,4.412955693079143,,0,0,0,4.412955693079143,174.4140491132423,,0,0,0,174.4140491132423,55.85299296601732,,0,0,0,55.85299296601732,30.597042423687423,,0,0,0,30.597042423687423,121.52350175690421,,0,0,0,121.52350175690421
65,HIS,8.309357671800422,,0,0,0,8.309357671800422,4.402825821994671,,0,0,0,4.402825821994671,175.8667377486791,,0,0,0,175.8667377486791,55.7775299562604,,0,0,0,55.7775299562604,30.46718252979798,,0,0,0,30.46718252979798,122.92410180087136,,0,0,0,122.92410180087136
