RESNUM,RESNAME,H_X,H_Y,H_BEST_REF_SCORE,H_BEST_REF_COV,H_BEST_REF_MATCH,H_UCBShift,HA_X,HA_Y,HA_BEST_REF_SCORE,HA_BEST_REF_COV,HA_BEST_REF_MATCH,HA_UCBShift,C_X,C_Y,C_BEST_REF_SCORE,C_BEST_REF_COV,C_BEST_REF_MATCH,C_UCBShift,CA_X,CA_Y,CA_BEST_REF_SCORE,CA_BEST_REF_COV,CA_BEST_REF_MATCH,CA_UCBShift,CB_X,CB_Y,CB_BEST_REF_SCORE,CB_BEST_REF_COV,CB_BEST_REF_MATCH,CB_UCBShift,N_X,N_Y,N_BEST_REF_SCORE,N_BEST_REF_COV,N_BEST_REF_MATCH,N_UCBShift
1,TYR,8.238201845143745,,0,0,0,8.238201845143745,4.418263443681319,,0,0,0,4.418263443681319,176.2390242961039,,0,0,0,176.2390242961039,59.03895206055056,,0,0,0,59.03895206055056,38.75421268177378,,0,0,0,38.75421268177378,121.2988091564047,,0,0,0,121.2988091564047
2,TYR,8.194237674825175,,0,0,0,8.194237674825175,4.192001492737818,,0,0,0,4.192001492737818,176.99746747155623,,0,0,0,176.99746747155623,61.082771403280056,,0,0,0,61.082771403280056,38.889224816944164,,0,0,0,38.889224816944164,121.59274284129204,,0,0,0,121.59274284129204
3,MET,8.51474986094461,,0,0,0,8.51474986094461,4.093638950346875,,0,0,0,4.093638950346875,177.80575547726164,,0,0,0,177.80575547726164,56.93962224988345,,0,0,0,56.93962224988345,30.644904159002106,,0,0,0,30.644904159002106,116.61349294092018,,0,0,0,116.61349294092018
4,ASP,7.837752053191253,,0,0,0,7.837752053191253,4.347136415168165,,0,0,0,4.347136415168165,178.55572456536242,,0,0,0,178.55572456536242,57.513116173054726,,0,0,0,57.513116173054726,40.333002243234546,,0,0,0,40.333002243234546,120.73277996467976,,0,0,0,120.73277996467976
5,VAL,7.711653992385392,,0,0,0,7.711653992385392,3.548474987587413,,0,0,0,3.548474987587413,178.03624192104007,,0,0,0,178.03624192104007,66.03868358862805,,0,0,0,66.03868358862805,31.537809892746143,,0,0,0,31.537809892746143,120.03043837599068,,0,0,0,120.03043837599068
6,GLN,7.837916028321678,,0,0,0,7.837916028321678,3.8939723942224442,,0,0,0,3.8939723942224442,177.8273217533189,,0,0,0,177.8273217533189,59.38039969992786,,0,0,0,59.38039969992786,28.564317585531136,,0,0,0,28.564317585531136,120.66058324741924,,0,0,0,120.66058324741924
7,GLU,8.743831877061826,,0,0,0,8.743831877061826,3.753149557955932,,0,0,0,3.753149557955932,178.16344278584194,,0,0,0,178.16344278584194,59.994352574858475,,0,0,0,59.994352574858475,29.654448616999666,,0,0,0,29.654448616999666,120.13779539800755,,0,0,0,120.13779539800755
8,ALA,8.096297568048618,,0,0,0,8.096297568048618,4.09330537890443,,0,0,0,4.09330537890443,180.80868302924853,,0,0,0,180.80868302924853,55.010154064990566,,0,0,0,55.010154064990566,17.935057292252196,,0,0,0,17.935057292252196,120.8102812446942,,0,0,0,120.8102812446942
9,LYS,7.9394117626040615,,0,0,0,7.9394117626040615,4.15541236971917,,0,0,0,4.15541236971917,179.37860361529025,,0,0,0,179.37860361529025,59.408409699234106,,0,0,0,59.408409699234106,32.75545892781663,,0,0,0,32.75545892781663,119.52544924570985,,0,0,0,119.52544924570985
10,LEU,8.673307512315462,,0,0,0,8.673307512315462,3.979919797530248,,0,0,0,3.979919797530248,179.0683423220779,,0,0,0,179.0683423220779,57.837663685325786,,0,0,0,57.837663685325786,41.87597687933733,,0,0,0,41.87597687933733,120.57202431570651,,0,0,0,120.57202431570651
11,ARG,8.532498701914752,,0,0,0,8.532498701914752,3.775970618933844,,0,0,0,3.775970618933844,178.2213554394439,,0,0,0,178.2213554394439,60.01667257987568,,0,0,0,60.01667257987568,29.85135843807304,,0,0,0,29.85135843807304,120.27194421606171,,0,0,0,120.27194421606171
12,ASP,8.2042963502331,,0,0,0,8.2042963502331,4.425787800008325,,0,0,0,4.425787800008325,179.04137626025087,,0,0,0,179.04137626025087,57.21996053269508,,0,0,0,57.21996053269508,40.86010118509824,,0,0,0,40.86010118509824,119.2822603055833,,0,0,0,119.2822603055833
13,LYS,8.2339286508325,,0,0,0,8.2339286508325,4.154624899567099,,0,0,0,4.154624899567099,178.72076240987346,,0,0,0,178.72076240987346,59.06578321749362,,0,0,0,59.06578321749362,32.873950230441785,,0,0,0,32.873950230441785,119.89427643005884,,0,0,0,119.89427643005884
14,MET,8.138310065195915,,0,0,0,8.138310065195915,4.439747167260517,,0,0,0,4.439747167260517,176.7407716428072,,0,0,0,176.7407716428072,55.48827270986791,,0,0,0,55.48827270986791,32.76150641501832,,0,0,0,32.76150641501832,114.53180222211121,,0,0,0,114.53180222211121
15,ARG,7.636540213997114,,0,0,0,7.636540213997114,4.0878034750333,,0,0,0,4.0878034750333,177.3368237801088,,0,0,0,177.3368237801088,58.39100792433123,,0,0,0,58.39100792433123,30.00452833787879,,0,0,0,30.00452833787879,121.81445094840714,,0,0,0,121.81445094840714
16,GLY,8.837808012576312,,0,0,0,8.837808012576312,3.964626148914974,,0,0,0,3.964626148914974,174.95404988029748,,0,0,0,174.95404988029748,45.787397516144964,,0,0,0,45.787397516144964,,,0,0,0,,113.45880148445998,,0,0,0,113.45880148445998
17,THR,7.82523027901543,,0,0,0,7.82523027901543,4.301829650674326,,0,0,0,4.301829650674326,175.52799012944277,,0,0,0,175.52799012944277,62.17790903678544,,0,0,0,62.17790903678544,70.49151085694305,,0,0,0,70.49151085694305,110.6380632616994,,0,0,0,110.6380632616994
18,GLY,8.35653859025419,,0,0,0,8.35653859025419,4.002558756887557,,0,0,0,4.002558756887557,174.30954247811079,,0,0,0,174.30954247811079,45.31977305926296,,0,0,0,45.31977305926296,,,0,0,0,,110.37784833277833,,0,0,0,110.37784833277833
19,VAL,7.4689884748973245,,0,0,0,7.4689884748973245,4.270172197896548,,0,0,0,4.270172197896548,175.5200795900322,,0,0,0,175.5200795900322,62.70244456578977,,0,0,0,62.70244456578977,32.428329938306135,,0,0,0,32.428329938306135,121.48614930788656,,0,0,0,121.48614930788656
20,SER,8.753462676795428,,0,0,0,8.753462676795428,4.7261153163669665,,0,0,0,4.7261153163669665,173.23516808013653,,0,0,0,173.23516808013653,57.61586927626817,,0,0,0,57.61586927626817,64.72022642765567,,0,0,0,64.72022642765567,122.69722062938727,,0,0,0,122.69722062938727
21,VAL,8.682016685081585,,0,0,0,8.682016685081585,4.59386570051615,,0,0,0,4.59386570051615,175.62920482205573,,0,0,0,175.62920482205573,61.49280628189588,,0,0,0,61.49280628189588,32.64693925346875,,0,0,0,32.64693925346875,125.01218994133644,,0,0,0,125.01218994133644
22,THR,9.067432946703297,,0,0,0,9.067432946703297,4.593509870396271,,0,0,0,4.593509870396271,173.04918408450436,,0,0,0,173.04918408450436,61.28452136083361,,0,0,0,61.28452136083361,70.92499974488844,,0,0,0,70.92499974488844,122.2362619592796,,0,0,0,122.2362619592796
23,ARG,8.902372444960596,,0,0,0,8.902372444960596,4.860346504284604,,0,0,0,4.860346504284604,175.6181577636974,,0,0,0,175.6181577636974,55.118065775135975,,0,0,0,55.118065775135975,31.616898033877234,,0,0,0,31.616898033877234,127.84658090445666,,0,0,0,127.84658090445666
24,SER,8.770034686513487,,0,0,0,8.770034686513487,4.661072452358752,,0,0,0,4.661072452358752,174.58683923656343,,0,0,0,174.58683923656343,56.52478052076257,,0,0,0,56.52478052076257,63.49785823469308,,0,0,0,63.49785823469308,122.58721689055389,,0,0,0,122.58721689055389
25,GLY,8.91590713914974,,0,0,0,8.91590713914974,4.020739821051171,,0,0,0,4.020739821051171,174.31736362518038,,0,0,0,174.31736362518038,47.27219792289932,,0,0,0,47.27219792289932,,,0,0,0,,118.36146827534131,,0,0,0,118.36146827534131
26,ASP,8.760349717138418,,0,0,0,8.760349717138418,4.802785036899212,,0,0,0,4.802785036899212,175.12853777927074,,0,0,0,175.12853777927074,54.22096122375957,,0,0,0,54.22096122375957,41.10265377003552,,0,0,0,41.10265377003552,126.53058045112667,,0,0,0,126.53058045112667
27,ASN,8.012680951648353,,0,0,0,8.012680951648353,5.379843559940061,,0,0,0,5.379843559940061,174.33410806450215,,0,0,0,174.33410806450215,52.625214851853706,,0,0,0,52.625214851853706,41.460723486879786,,0,0,0,41.460723486879786,118.86099952339328,,0,0,0,118.86099952339328
28,ILE,9.207327294394494,,0,0,0,9.207327294394494,4.561650715712066,,0,0,0,4.561650715712066,174.8073627004107,,0,0,0,174.8073627004107,61.195670073254526,,0,0,0,61.195670073254526,39.438691107958704,,0,0,0,39.438691107958704,123.20039068444333,,0,0,0,123.20039068444333
29,ILE,9.216246867432567,,0,0,0,9.216246867432567,4.786661124597625,,0,0,0,4.786661124597625,175.07840354223,,0,0,0,175.07840354223,60.30088653262293,,0,0,0,60.30088653262293,38.85422015390165,,0,0,0,38.85422015390165,127.65075034667,,0,0,0,127.65075034667
30,LEU,9.227518134992787,,0,0,0,9.227518134992787,5.103440227411477,,0,0,0,5.103440227411477,175.5039857675824,,0,0,0,175.5039857675824,53.165258291264294,,0,0,0,53.165258291264294,42.122686657642355,,0,0,0,42.122686657642355,128.46621211019536,,0,0,0,128.46621211019536
31,ASN,9.046973492451992,,0,0,0,9.046973492451992,4.92608492985903,,0,0,0,4.92608492985903,173.87020291838715,,0,0,0,173.87020291838715,52.820112846997446,,0,0,0,52.820112846997446,39.40132956924187,,0,0,0,39.40132956924187,124.50985436229325,,0,0,0,124.50985436229325
32,MET,9.258644602453103,,0,0,0,9.258644602453103,5.265653108730159,,0,0,0,5.265653108730159,173.46739912736152,,0,0,0,173.46739912736152,52.756304818492616,,0,0,0,52.756304818492616,33.812160766655566,,0,0,0,33.812160766655566,125.82404620979577,,0,0,0,125.82404620979577
33,PRO,,,0,0,0,,4.5434789444388946,,0,0,0,4.5434789444388946,177.8877152861805,,0,0,0,177.8877152861805,63.27870044275724,,0,0,0,63.27870044275724,32.40364774205794,,0,0,0,32.40364774205794,,,0,0,0,
34,ASN,9.164820052491953,,0,0,0,9.164820052491953,4.419654606393607,,0,0,0,4.419654606393607,176.79524558402707,,0,0,0,176.79524558402707,57.77830954110889,,0,0,0,57.77830954110889,39.733624504234655,,0,0,0,39.733624504234655,123.20804793931624,,0,0,0,123.20804793931624
35,ASN,8.817822812182262,,0,0,0,8.817822812182262,4.476302190714841,,0,0,0,4.476302190714841,176.99821228226773,,0,0,0,176.99821228226773,56.26980943766789,,0,0,0,56.26980943766789,38.56114720979021,,0,0,0,38.56114720979021,116.11482679377845,,0,0,0,116.11482679377845
36,VAL,7.872385122177822,,0,0,0,7.872385122177822,3.864514856110556,,0,0,0,3.864514856110556,177.18951222626262,,0,0,0,177.18951222626262,65.44674831557887,,0,0,0,65.44674831557887,31.860003226751026,,0,0,0,31.860003226751026,115.64117590928517,,0,0,0,115.64117590928517
37,THR,7.954141770762571,,0,0,0,7.954141770762571,3.967500138744588,,0,0,0,3.967500138744588,174.38783068563657,,0,0,0,174.38783068563657,64.83999218999888,,0,0,0,64.83999218999888,70.5044830422078,,0,0,0,70.5044830422078,115.49331295709845,,0,0,0,115.49331295709845
38,PHE,8.443650865928516,,0,0,0,8.443650865928516,5.237886074536574,,0,0,0,5.237886074536574,175.01445301443002,,0,0,0,175.01445301443002,57.00038031501277,,0,0,0,57.00038031501277,42.862247784304586,,0,0,0,42.862247784304586,118.15814466894771,,0,0,0,118.15814466894771
39,ASP,8.613417331018981,,0,0,0,8.613417331018981,4.7236468701548455,,0,0,0,4.7236468701548455,176.3422103976801,,0,0,0,176.3422103976801,54.40323091916417,,0,0,0,54.40323091916417,42.64559943780109,,0,0,0,42.64559943780109,122.37815216034521,,0,0,0,122.37815216034521
40,SER,8.51407544046509,,0,0,0,8.51407544046509,4.3327886930486175,,0,0,0,4.3327886930486175,175.0967176146298,,0,0,0,175.0967176146298,59.97164521457431,,0,0,0,59.97164521457431,63.04707547480297,,0,0,0,63.04707547480297,116.91125447714508,,0,0,0,116.91125447714508
41,SER,8.617714465745367,,0,0,0,8.617714465745367,4.30444218006438,,0,0,0,4.30444218006438,173.6193011132978,,0,0,0,173.6193011132978,59.325937592979244,,0,0,0,59.325937592979244,62.97833410879121,,0,0,0,62.97833410879121,118.0817569014763,,0,0,0,118.0817569014763
42,SER,7.834271566516817,,0,0,0,7.834271566516817,4.780358720468421,,0,0,0,4.780358720468421,174.450926531907,,0,0,0,174.450926531907,57.25576256119991,,0,0,0,57.25576256119991,65.36517849291819,,0,0,0,65.36517849291819,116.56370531828172,,0,0,0,116.56370531828172
43,ALA,8.548697892851592,,0,0,0,8.548697892851592,4.0331299820679325,,0,0,0,4.0331299820679325,177.13496150853592,,0,0,0,177.13496150853592,52.06341445991231,,0,0,0,52.06341445991231,18.983433309451662,,0,0,0,18.983433309451662,123.8281335968476,,0,0,0,123.8281335968476
44,THR,7.849894802858254,,0,0,0,7.849894802858254,4.408554408075258,,0,0,0,4.408554408075258,174.36977409559884,,0,0,0,174.36977409559884,62.83266686572871,,0,0,0,62.83266686572871,69.55000282920413,,0,0,0,69.55000282920413,116.10338337134532,,0,0,0,116.10338337134532
45,LEU,8.860523417449219,,0,0,0,8.860523417449219,4.079231145104895,,0,0,0,4.079231145104895,177.69124807296038,,0,0,0,177.69124807296038,55.49566987165057,,0,0,0,55.49566987165057,42.6429226019536,,0,0,0,42.6429226019536,129.31398392841604,,0,0,0,129.31398392841604
46,LYS,8.746601636052837,,0,0,0,8.746601636052837,4.579273496581196,,0,0,0,4.579273496581196,176.1163879108225,,0,0,0,176.1163879108225,55.11345602781663,,0,0,0,55.11345602781663,31.909082881979135,,0,0,0,31.909082881979135,127.59999732919857,,0,0,0,127.59999732919857
47,PRO,,,0,0,0,,4.26258805503108,,0,0,0,4.26258805503108,178.66056250311357,,0,0,0,178.66056250311357,66.0845009559052,,0,0,0,66.0845009559052,31.762530820152072,,0,0,0,31.762530820152072,,,0,0,0,
48,ALA,8.458994726723276,,0,0,0,8.458994726723276,4.08328061994117,,0,0,0,4.08328061994117,180.1671922362693,,0,0,0,180.1671922362693,54.73698906849262,,0,0,0,54.73698906849262,18.344242702214455,,0,0,0,18.344242702214455,118.68351591328671,,0,0,0,118.68351591328671
49,GLY,7.797448117349318,,0,0,0,7.797448117349318,3.5302182025308024,,0,0,0,3.5302182025308024,175.17209290670996,,0,0,0,175.17209290670996,46.961321775036076,,0,0,0,46.961321775036076,,,0,0,0,,108.09670527168942,,0,0,0,108.09670527168942
50,ALA,8.796423083610835,,0,0,0,8.796423083610835,3.8056391671384175,,0,0,0,3.8056391671384175,179.72151615204797,,0,0,0,179.72151615204797,55.20082734154734,,0,0,0,55.20082734154734,18.068507634426688,,0,0,0,18.068507634426688,124.80117623780109,,0,0,0,124.80117623780109
51,ASN,8.401811835159286,,0,0,0,8.401811835159286,4.545068828310579,,0,0,0,4.545068828310579,177.97495524893438,,0,0,0,177.97495524893438,55.99380264065379,,0,0,0,55.99380264065379,37.94974194478854,,0,0,0,37.94974194478854,118.36568828462649,,0,0,0,118.36568828462649
52,THR,8.180676037340438,,0,0,0,8.180676037340438,3.8981365988095233,,0,0,0,3.8981365988095233,176.08406625608833,,0,0,0,176.08406625608833,67.20616761762682,,0,0,0,67.20616761762682,68.34469088642469,,0,0,0,68.34469088642469,118.9200184485459,,0,0,0,118.9200184485459
53,LEU,8.73089330160395,,0,0,0,8.73089330160395,3.964890937959263,,0,0,0,3.964890937959263,179.05307222843823,,0,0,0,179.05307222843823,57.925191225568874,,0,0,0,57.925191225568874,41.207729366111664,,0,0,0,41.207729366111664,121.370740850555,,0,0,0,121.370740850555
54,THR,8.740109191852593,,0,0,0,8.740109191852593,3.876408840345766,,0,0,0,3.876408840345766,176.63850103437673,,0,0,0,176.63850103437673,67.05020593298923,,0,0,0,67.05020593298923,68.31040714826284,,0,0,0,68.31040714826284,117.53125787774448,,0,0,0,117.53125787774448
55,GLY,8.072931898451548,,0,0,0,8.072931898451548,3.8081252650238646,,0,0,0,3.8081252650238646,175.91797921055056,,0,0,0,175.91797921055056,47.20120918461539,,0,0,0,47.20120918461539,,,0,0,0,,109.38115928109113,,0,0,0,109.38115928109113
56,VAL,8.458601355189254,,0,0,0,8.458601355189254,3.587815856476856,,0,0,0,3.587815856476856,177.8736261398657,,0,0,0,177.8736261398657,66.96227871544566,,0,0,0,66.96227871544566,31.734794785619936,,0,0,0,31.734794785619936,122.43816118718503,,0,0,0,122.43816118718503
57,ALA,8.926815977683429,,0,0,0,8.926815977683429,3.8777536265734267,,0,0,0,3.8777536265734267,179.2320978434399,,0,0,0,179.2320978434399,55.606173305661,,0,0,0,55.606173305661,18.27184152689533,,0,0,0,18.27184152689533,122.19869492561327,,0,0,0,122.19869492561327
58,MET,8.210761718165168,,0,0,0,8.210761718165168,4.03220207955933,,0,0,0,4.03220207955933,178.841430218365,,0,0,0,178.841430218365,58.8354754517538,,0,0,0,58.8354754517538,32.764829317660116,,0,0,0,32.764829317660116,115.30372665861361,,0,0,0,115.30372665861361
59,VAL,7.6245858563048055,,0,0,0,7.6245858563048055,3.661567208777333,,0,0,0,3.661567208777333,178.14054847868243,,0,0,0,178.14054847868243,66.29036571046731,,0,0,0,66.29036571046731,31.698685723626372,,0,0,0,31.698685723626372,118.86678992947053,,0,0,0,118.86678992947053
60,LEU,8.741680894366745,,0,0,0,8.741680894366745,4.032960708635809,,0,0,0,4.032960708635809,178.71183265188145,,0,0,0,178.71183265188145,57.50184410966256,,0,0,0,57.50184410966256,41.567100956737704,,0,0,0,41.567100956737704,119.14609909322344,,0,0,0,119.14609909322344
61,LYS,8.12867134069819,,0,0,0,8.12867134069819,3.9530135590853592,,0,0,0,3.9530135590853592,179.31364824881229,,0,0,0,179.31364824881229,59.20306977835498,,0,0,0,59.20306977835498,32.52235912743923,,0,0,0,32.52235912743923,117.03224694088689,,0,0,0,117.03224694088689
62,GLU,7.597121082539683,,0,0,0,7.597121082539683,3.9934349861804863,,0,0,0,3.9934349861804863,176.33536342368743,,0,0,0,176.33536342368743,57.76029331798202,,0,0,0,57.76029331798202,30.378523985714285,,0,0,0,30.378523985714285,116.85441089448885,,0,0,0,116.85441089448885
63,TYR,7.766224412765013,,0,0,0,7.766224412765013,5.092864038272839,,0,0,0,5.092864038272839,174.47329423433234,,0,0,0,174.47329423433234,54.940218519441665,,0,0,0,54.940218519441665,38.36190006668331,,0,0,0,38.36190006668331,117.3072633587801,,0,0,0,117.3072633587801
64,PRO,,,0,0,0,,4.484539026437451,,0,0,0,4.484539026437451,177.2197326490232,,0,0,0,177.2197326490232,64.41635366828172,,0,0,0,64.41635366828172,32.12182312106782,,0,0,0,32.12182312106782,,,0,0,0,
65,LYS,8.552558969952269,,0,0,0,8.552558969952269,4.402143113147963,,0,0,0,4.402143113147963,176.46200318845598,,0,0,0,176.46200318845598,56.228827647669,,0,0,0,56.228827647669,32.40423542590743,,0,0,0,32.40423542590743,118.04798685670995,,0,0,0,118.04798685670995
66,THR,7.592812618492618,,0,0,0,7.592812618492618,5.193494941452991,,0,0,0,5.193494941452991,172.9580686564602,,0,0,0,172.9580686564602,61.872423469663666,,0,0,0,61.872423469663666,71.25420019570984,,0,0,0,71.25420019570984,114.92837616553446,,0,0,0,114.92837616553446
67,ALA,9.11566021093351,,0,0,0,9.11566021093351,4.752464545537796,,0,0,0,4.752464545537796,176.15141914811855,,0,0,0,176.15141914811855,51.12595281118326,,0,0,0,51.12595281118326,20.05935555663226,,0,0,0,20.05935555663226,130.53047599385613,,0,0,0,130.53047599385613
68,VAL,9.009197679970029,,0,0,0,9.009197679970029,4.572345541247641,,0,0,0,4.572345541247641,173.91909283720724,,0,0,0,173.91909283720724,61.42339537862138,,0,0,0,61.42339537862138,33.22963613744589,,0,0,0,33.22963613744589,121.50656675528916,,0,0,0,121.50656675528916
69,ASN,9.06844537923188,,0,0,0,9.06844537923188,5.343923532967034,,0,0,0,5.343923532967034,174.21485551940282,,0,0,0,174.21485551940282,51.91321608061938,,0,0,0,51.91321608061938,40.652759195548896,,0,0,0,40.652759195548896,126.22263893026972,,0,0,0,126.22263893026972
70,VAL,9.215177442063492,,0,0,0,9.215177442063492,4.6332443497114,,0,0,0,4.6332443497114,174.1950563376457,,0,0,0,174.1950563376457,61.470837823509825,,0,0,0,61.470837823509825,32.29951000163725,,0,0,0,32.29951000163725,127.58691317529693,,0,0,0,127.58691317529693
71,ILE,9.368163671589521,,0,0,0,9.368163671589521,4.83198859956155,,0,0,0,4.83198859956155,175.85983679725274,,0,0,0,175.85983679725274,59.608824902608504,,0,0,0,59.608824902608504,39.29052069012099,,0,0,0,39.29052069012099,127.10058237093463,,0,0,0,127.10058237093463
72,GLY,8.992038499617049,,0,0,0,8.992038499617049,3.9398589996198243,,0,0,0,3.9398589996198243,171.92673579275726,,0,0,0,171.92673579275726,44.68290544016539,,0,0,0,44.68290544016539,,,0,0,0,,115.65750020836386,,0,0,0,115.65750020836386
73,TYR,8.986307873598623,,0,0,0,8.986307873598623,5.411800810778111,,0,0,0,5.411800810778111,175.88669426296482,,0,0,0,175.88669426296482,57.001993041563985,,0,0,0,57.001993041563985,41.8798856543068,,0,0,0,41.8798856543068,121.39963324893439,,0,0,0,121.39963324893439
74,THR,8.913039983155734,,0,0,0,8.913039983155734,4.80277457006882,,0,0,0,4.80277457006882,173.55121340504493,,0,0,0,173.55121340504493,59.640373378982126,,0,0,0,59.640373378982126,71.41915037625152,,0,0,0,71.41915037625152,111.296658896892,,0,0,0,111.296658896892
75,ASP,8.333215323981573,,0,0,0,8.333215323981573,4.869732075191475,,0,0,0,4.869732075191475,176.8258987480575,,0,0,0,176.8258987480575,52.83416820897991,,0,0,0,52.83416820897991,42.10739449643135,,0,0,0,42.10739449643135,118.99467241400266,,0,0,0,118.99467241400266
76,SER,8.374910506199356,,0,0,0,8.374910506199356,4.436717726007326,,0,0,0,4.436717726007326,174.6675631456599,,0,0,0,174.6675631456599,59.55333372157842,,0,0,0,59.55333372157842,63.558974569203016,,0,0,0,63.558974569203016,113.34255020119325,,0,0,0,113.34255020119325
77,THR,7.724965106465757,,0,0,0,7.724965106465757,4.332483674012098,,0,0,0,4.332483674012098,174.22894824065932,,0,0,0,174.22894824065932,62.071092309956704,,0,0,0,62.071092309956704,69.14252731322566,,0,0,0,69.14252731322566,117.57935588746254,,0,0,0,117.57935588746254
78,GLY,8.36004296924742,,0,0,0,8.36004296924742,4.015291043043067,,0,0,0,4.015291043043067,174.17039272484183,,0,0,0,174.17039272484183,44.64821002949828,,0,0,0,44.64821002949828,,,0,0,0,,112.69800489188589,,0,0,0,112.69800489188589
79,GLY,8.27417785945166,,0,0,0,8.27417785945166,4.022729526481852,,0,0,0,4.022729526481852,174.72128335990675,,0,0,0,174.72128335990675,45.051186111349764,,0,0,0,45.051186111349764,,,0,0,0,,108.9773494568709,,0,0,0,108.9773494568709
80,HIS,8.963752647252747,,0,0,0,8.963752647252747,4.038845052813853,,0,0,0,4.038845052813853,176.73678420261405,,0,0,0,176.73678420261405,60.526430634243525,,0,0,0,60.526430634243525,29.60560306945832,,0,0,0,29.60560306945832,121.68319706134422,,0,0,0,121.68319706134422
81,ASP,8.904080671495171,,0,0,0,8.904080671495171,4.384796295149295,,0,0,0,4.384796295149295,178.60947935640473,,0,0,0,178.60947935640473,57.327757001681654,,0,0,0,57.327757001681654,40.0847208472361,,0,0,0,40.0847208472361,117.04989343442669,,0,0,0,117.04989343442669
82,LEU,7.959943881385281,,0,0,0,7.959943881385281,4.097337831379732,,0,0,0,4.097337831379732,179.03970365720946,,0,0,0,179.03970365720946,57.41811592957043,,0,0,0,57.41811592957043,41.653269276401375,,0,0,0,41.653269276401375,120.6438647059829,,0,0,0,120.6438647059829
83,ASN,8.329498611061162,,0,0,0,8.329498611061162,4.4258416466866475,,0,0,0,4.4258416466866475,178.3038803144078,,0,0,0,178.3038803144078,56.167451184221335,,0,0,0,56.167451184221335,38.76339802698968,,0,0,0,38.76339802698968,119.4070947984016,,0,0,0,119.4070947984016
84,MET,8.576530302447551,,0,0,0,8.576530302447551,4.08447743045288,,0,0,0,4.08447743045288,178.54769136043402,,0,0,0,178.54769136043402,57.6461917535742,,0,0,0,57.6461917535742,32.059971142202244,,0,0,0,32.059971142202244,121.09604390797536,,0,0,0,121.09604390797536
85,ARG,8.048466021778221,,0,0,0,8.048466021778221,4.026503111971362,,0,0,0,4.026503111971362,178.76302093825066,,0,0,0,178.76302093825066,59.34480442715618,,0,0,0,59.34480442715618,30.117027942285493,,0,0,0,30.117027942285493,119.65917267153957,,0,0,0,119.65917267153957
86,LEU,8.510978039343989,,0,0,0,8.510978039343989,3.9933145285547784,,0,0,0,3.9933145285547784,179.07335635359638,,0,0,0,179.07335635359638,57.392172725890774,,0,0,0,57.392172725890774,41.41318788374404,,0,0,0,41.41318788374404,121.96284703851148,,0,0,0,121.96284703851148
87,SER,8.806499104495504,,0,0,0,8.806499104495504,3.9655482201187695,,0,0,0,3.9655482201187695,176.6736367472694,,0,0,0,176.6736367472694,62.27103039543235,,0,0,0,62.27103039543235,62.59147989029304,,0,0,0,62.59147989029304,115.98029261751027,,0,0,0,115.98029261751027
88,GLN,8.314818292368743,,0,0,0,8.314818292368743,3.8958608471472966,,0,0,0,3.8958608471472966,178.17530638988788,,0,0,0,178.17530638988788,59.03266229504385,,0,0,0,59.03266229504385,28.29154458274503,,0,0,0,28.29154458274503,122.79375502930958,,0,0,0,122.79375502930958
89,GLN,8.31781280864691,,0,0,0,8.31781280864691,4.025496228205128,,0,0,0,4.025496228205128,179.11190492358196,,0,0,0,179.11190492358196,59.19965115945721,,0,0,0,59.19965115945721,28.541901801986903,,0,0,0,28.541901801986903,118.7065024928849,,0,0,0,118.7065024928849