RESNUM,RESNAME,H_X,H_Y,H_BEST_REF_SCORE,H_BEST_REF_COV,H_BEST_REF_MATCH,H_UCBShift,HA_X,HA_Y,HA_BEST_REF_SCORE,HA_BEST_REF_COV,HA_BEST_REF_MATCH,HA_UCBShift,C_X,C_Y,C_BEST_REF_SCORE,C_BEST_REF_COV,C_BEST_REF_MATCH,C_UCBShift,CA_X,CA_Y,CA_BEST_REF_SCORE,CA_BEST_REF_COV,CA_BEST_REF_MATCH,CA_UCBShift,CB_X,CB_Y,CB_BEST_REF_SCORE,CB_BEST_REF_COV,CB_BEST_REF_MATCH,CB_UCBShift,N_X,N_Y,N_BEST_REF_SCORE,N_BEST_REF_COV,N_BEST_REF_MATCH,N_UCBShift
1,MET,8.376280955544456,,0,0,0,8.376280955544456,4.453279568659118,,0,0,0,4.453279568659118,174.2593619034743,,0,0,0,174.2593619034743,55.11768893352758,,0,0,0,55.11768893352758,33.03351934463314,,0,0,0,33.03351934463314,124.06599600066045,,0,0,0,124.06599600066045
2,ALA,8.801408807037408,,0,0,0,8.801408807037408,5.3076562780663785,,0,0,0,5.3076562780663785,176.2867715452492,,0,0,0,176.2867715452492,51.76855434746365,,0,0,0,51.76855434746365,21.204713591131096,,0,0,0,21.204713591131096,128.11463161414142,,0,0,0,128.11463161414142
3,GLU,9.06526387924853,,0,0,0,9.06526387924853,4.89234186003996,,0,0,0,4.89234186003996,174.75275080159284,,0,0,0,174.75275080159284,54.547334140848044,,0,0,0,54.547334140848044,33.32396408189588,,0,0,0,33.32396408189588,121.03269220390166,,0,0,0,121.03269220390166
4,ILE,8.794410434676434,,0,0,0,8.794410434676434,5.036397221162172,,0,0,0,5.036397221162172,174.62630905829727,,0,0,0,174.62630905829727,59.827369657603505,,0,0,0,59.827369657603505,40.22093601283161,,0,0,0,40.22093601283161,120.57513452387613,,0,0,0,120.57513452387613
5,GLN,8.72579102014097,,0,0,0,8.72579102014097,5.024030114674215,,0,0,0,5.024030114674215,175.00367698367742,,0,0,0,175.00367698367742,54.28882973110778,,0,0,0,54.28882973110778,32.86966342063492,,0,0,0,32.86966342063492,124.51724392740593,,0,0,0,124.51724392740593
6,PHE,8.634044166378066,,0,0,0,8.634044166378066,5.598674569347318,,0,0,0,5.598674569347318,175.5826127273449,,0,0,0,175.5826127273449,57.99587019830725,,0,0,0,57.99587019830725,40.87645278997114,,0,0,0,40.87645278997114,120.92907077023531,,0,0,0,120.92907077023531
7,SER,7.777164556937508,,0,0,0,7.777164556937508,5.022860842579643,,0,0,0,5.022860842579643,173.9508335638417,,0,0,0,173.9508335638417,56.65875299134754,,0,0,0,56.65875299134754,65.83233101259852,,0,0,0,65.83233101259852,112.85085212199468,,0,0,0,112.85085212199468
8,LYS,8.701156945521145,,0,0,0,8.701156945521145,3.6088746059523813,,0,0,0,3.6088746059523813,177.67992920729824,,0,0,0,177.67992920729824,58.13063099778555,,0,0,0,58.13063099778555,31.89256211602842,,0,0,0,31.89256211602842,124.93042155533911,,0,0,0,124.93042155533911
9,GLY,10.235705279648128,,0,0,0,10.235705279648128,3.8379981303280055,,0,0,0,3.8379981303280055,173.86738221754356,,0,0,0,173.86738221754356,45.119826103862806,,0,0,0,45.119826103862806,,,0,0,0,,113.26990881660562,,0,0,0,113.26990881660562
10,VAL,7.879266854628704,,0,0,0,7.879266854628704,4.2768019375235875,,0,0,0,4.2768019375235875,174.82050021050063,,0,0,0,174.82050021050063,61.802908899472754,,0,0,0,61.802908899472754,33.35296275853591,,0,0,0,33.35296275853591,122.86492660183706,,0,0,0,122.86492660183706
11,ALA,8.615563716489067,,0,0,0,8.615563716489067,4.510379173981574,,0,0,0,4.510379173981574,177.14790069657565,,0,0,0,177.14790069657565,52.11813044136974,,0,0,0,52.11813044136974,19.179916961366413,,0,0,0,19.179916961366413,130.60090562302696,,0,0,0,130.60090562302696
12,GLU,8.874750573604173,,0,0,0,8.874750573604173,4.539012072150072,,0,0,0,4.539012072150072,176.86038908434898,,0,0,0,176.86038908434898,56.461172592574094,,0,0,0,56.461172592574094,30.193304803552003,,0,0,0,30.193304803552003,125.3206323443057,,0,0,0,125.3206323443057
13,THR,8.445369456965258,,0,0,0,8.445369456965258,4.393734327833277,,0,0,0,4.393734327833277,175.35337925875234,,0,0,0,175.35337925875234,62.10354653449883,,0,0,0,62.10354653449883,69.70924528959928,,0,0,0,69.70924528959928,117.99111691350316,,0,0,0,117.99111691350316
14,VAL,8.403218062326562,,0,0,0,8.403218062326562,3.9629734077394825,,0,0,0,3.9629734077394825,175.1244726447275,,0,0,0,175.1244726447275,62.63736401937507,,0,0,0,62.63736401937507,32.754049583566434,,0,0,0,32.754049583566434,124.47717233920524,,0,0,0,124.47717233920524
15,VAL,8.281401117737817,,0,0,0,8.281401117737817,4.226379446184372,,0,0,0,4.226379446184372,174.91483176373626,,0,0,0,174.91483176373626,60.17300401489066,,0,0,0,60.17300401489066,32.44906323876124,,0,0,0,32.44906323876124,127.81612996707736,,0,0,0,127.81612996707736
16,PRO,,,0,0,0,,4.3250278303085805,,0,0,0,4.3250278303085805,175.8540327780664,,0,0,0,175.8540327780664,61.7111977529748,,0,0,0,61.7111977529748,31.773993106260406,,0,0,0,31.773993106260406,,,0,0,0,
17,GLU,8.486380917160616,,0,0,0,8.486380917160616,4.381964094677544,,0,0,0,4.381964094677544,175.75578668916637,,0,0,0,175.75578668916637,56.16392354194694,,0,0,0,56.16392354194694,30.742376034998337,,0,0,0,30.742376034998337,120.27412506360862,,0,0,0,120.27412506360862
18,VAL,8.591943244433343,,0,0,0,8.591943244433343,4.695328994622044,,0,0,0,4.695328994622044,175.51300733100788,,0,0,0,175.51300733100788,61.21121105167055,,0,0,0,61.21121105167055,33.43263797863803,,0,0,0,33.43263797863803,125.10885548809524,,0,0,0,125.10885548809524
19,ARG,8.940464851376401,,0,0,0,8.940464851376401,4.823876748717949,,0,0,0,4.823876748717949,174.82391227281607,,0,0,0,174.82391227281607,54.722456024597626,,0,0,0,54.722456024597626,31.89902608158508,,0,0,0,31.89902608158508,127.5924636539405,,0,0,0,127.5924636539405
20,LEU,8.944855557187257,,0,0,0,8.944855557187257,5.072839631501831,,0,0,0,5.072839631501831,175.82854589095348,,0,0,0,175.82854589095348,54.07296042794983,,0,0,0,54.07296042794983,44.36560055405705,,0,0,0,44.36560055405705,127.04874817092906,,0,0,0,127.04874817092906
21,SER,9.075899247224998,,0,0,0,9.075899247224998,4.889465478010878,,0,0,0,4.889465478010878,172.71526565179263,,0,0,0,172.71526565179263,57.172679761999106,,0,0,0,57.172679761999106,65.31130429227439,,0,0,0,65.31130429227439,120.95591083372739,,0,0,0,120.95591083372739
22,LYS,8.906365802369852,,0,0,0,8.906365802369852,4.616536870945721,,0,0,0,4.616536870945721,176.55645622783328,,0,0,0,176.55645622783328,55.30620313926074,,0,0,0,55.30620313926074,34.503888348507054,,0,0,0,34.503888348507054,125.54004945523366,,0,0,0,125.54004945523366
23,SER,8.842375360428461,,0,0,0,8.842375360428461,4.507195212415362,,0,0,0,4.507195212415362,176.50920741589522,,0,0,0,176.50920741589522,58.040942814868465,,0,0,0,58.040942814868465,64.26884708110222,,0,0,0,64.26884708110222,121.93440476596182,,0,0,0,121.93440476596182
24,LYS,8.742454023038071,,0,0,0,8.742454023038071,4.272034063397713,,0,0,0,4.272034063397713,176.50844244903428,,0,0,0,176.50844244903428,58.43064198322234,,0,0,0,58.43064198322234,32.07903999445555,,0,0,0,32.07903999445555,122.92619257824954,,0,0,0,122.92619257824954
25,ASN,7.883705011860362,,0,0,0,7.883705011860362,4.643752552070152,,0,0,0,4.643752552070152,175.86785795372958,,0,0,0,175.86785795372958,52.455251337690086,,0,0,0,52.455251337690086,37.92139823376623,,0,0,0,37.92139823376623,114.29594578628038,,0,0,0,114.29594578628038
26,GLY,8.197537234088134,,0,0,0,8.197537234088134,3.67669701064491,,0,0,0,3.67669701064491,174.56400029718614,,0,0,0,174.56400029718614,46.0002744463592,,0,0,0,46.0002744463592,,,0,0,0,,108.84448107481963,,0,0,0,108.84448107481963
27,GLN,8.349120583533134,,0,0,0,8.349120583533134,4.235345877405927,,0,0,0,4.235345877405927,176.07521618452103,,0,0,0,176.07521618452103,56.866238083277835,,0,0,0,56.866238083277835,29.973115843939393,,0,0,0,29.973115843939393,118.69926129343989,,0,0,0,118.69926129343989
28,SER,8.354958124087025,,0,0,0,8.354958124087025,5.2050480008325,,0,0,0,5.2050480008325,174.51283006762682,,0,0,0,174.51283006762682,57.253229095865244,,0,0,0,57.253229095865244,65.78124254211345,,0,0,0,65.78124254211345,113.18685113390498,,0,0,0,113.18685113390498
29,GLY,9.113220495115996,,0,0,0,9.113220495115996,4.263568089757465,,0,0,0,4.263568089757465,172.27505883028638,,0,0,0,172.27505883028638,44.388336073115774,,0,0,0,44.388336073115774,,,0,0,0,,109.61565431522921,,0,0,0,109.61565431522921
30,MET,9.124908658019757,,0,0,0,9.124908658019757,5.201063492390943,,0,0,0,5.201063492390943,174.40171250728162,,0,0,0,174.40171250728162,54.59168201264291,,0,0,0,54.59168201264291,36.52368493377733,,0,0,0,36.52368493377733,120.50414376893106,,0,0,0,120.50414376893106
31,ALA,8.885133404667556,,0,0,0,8.885133404667556,5.228845733882785,,0,0,0,5.228845733882785,175.95521216206018,,0,0,0,175.95521216206018,49.75738950542235,,0,0,0,49.75738950542235,21.239118452874905,,0,0,0,21.239118452874905,129.7498959070152,,0,0,0,129.7498959070152
32,LYS,8.859447887523586,,0,0,0,8.859447887523586,5.317031492529692,,0,0,0,5.317031492529692,175.64416075544455,,0,0,0,175.64416075544455,54.933077972921524,,0,0,0,54.933077972921524,35.06992634515485,,0,0,0,35.06992634515485,124.48451271721058,,0,0,0,124.48451271721058
33,PHE,9.617670370740372,,0,0,0,9.617670370740372,5.205483653518702,,0,0,0,5.205483653518702,174.81633011107226,,0,0,0,174.81633011107226,56.3533465021423,,0,0,0,56.3533465021423,42.00862555616606,,0,0,0,42.00862555616606,121.87306206222111,,0,0,0,121.87306206222111
34,TYR,9.07646350118215,,0,0,0,9.07646350118215,5.460743327161727,,0,0,0,5.460743327161727,174.00061076498503,,0,0,0,174.00061076498503,56.24082074736374,,0,0,0,56.24082074736374,41.20126801812077,,0,0,0,41.20126801812077,124.32846418093573,,0,0,0,124.32846418093573
35,PHE,9.27452888005328,,0,0,0,9.27452888005328,4.82587249115884,,0,0,0,4.82587249115884,174.5594428001221,,0,0,0,174.5594428001221,56.45848578774004,,0,0,0,56.45848578774004,40.77071159218559,,0,0,0,40.77071159218559,126.6967031091353,,0,0,0,126.6967031091353
36,LEU,8.855654674658675,,0,0,0,8.855654674658675,4.4427436950382955,,0,0,0,4.4427436950382955,176.6671943517205,,0,0,0,176.6671943517205,54.58291120064935,,0,0,0,54.58291120064935,42.91507306051171,,0,0,0,42.91507306051171,125.7819285529859,,0,0,0,125.7819285529859
37,GLU,8.782400536202687,,0,0,0,8.782400536202687,3.8529644709679207,,0,0,0,3.8529644709679207,174.498392848224,,0,0,0,174.498392848224,56.17428033621934,,0,0,0,56.17428033621934,27.942298926129425,,0,0,0,27.942298926129425,126.22970752716728,,0,0,0,126.22970752716728
38,PRO,,,0,0,0,,4.523239074875125,,0,0,0,4.523239074875125,177.57179872990343,,0,0,0,177.57179872990343,62.73835129468864,,0,0,0,62.73835129468864,32.4787066984016,,0,0,0,32.4787066984016,,,0,0,0,
39,THR,9.356714442013542,,0,0,0,9.356714442013542,4.02862851530414,,0,0,0,4.02862851530414,176.98012066779887,,0,0,0,176.98012066779887,64.89856713197914,,0,0,0,64.89856713197914,68.93527722052947,,0,0,0,68.93527722052947,114.9033707121101,,0,0,0,114.9033707121101
40,ILE,7.791473936496836,,0,0,0,7.791473936496836,4.072400388142413,,0,0,0,4.072400388142413,176.35246519782996,,0,0,0,176.35246519782996,62.86781134884005,,0,0,0,62.86781134884005,39.02578653296148,,0,0,0,39.02578653296148,122.42619850537797,,0,0,0,122.42619850537797
41,LEU,7.411070483155734,,0,0,0,7.411070483155734,4.293876341613942,,0,0,0,4.293876341613942,177.26058292072372,,0,0,0,177.26058292072372,54.150363733150186,,0,0,0,54.150363733150186,41.81634690124875,,0,0,0,41.81634690124875,115.4494657045954,,0,0,0,115.4494657045954
42,ALA,7.5737294803918305,,0,0,0,7.5737294803918305,4.215383285370185,,0,0,0,4.215383285370185,178.88221401757687,,0,0,0,178.88221401757687,52.53866290759241,,0,0,0,52.53866290759241,19.18959776731047,,0,0,0,19.18959776731047,123.8767988453935,,0,0,0,123.8767988453935
43,LYS,8.656351822410922,,0,0,0,8.656351822410922,4.132977246550672,,0,0,0,4.132977246550672,177.3168571629426,,0,0,0,177.3168571629426,58.207194545671,,0,0,0,58.207194545671,32.16861305656011,,0,0,0,32.16861305656011,121.88980002096238,,0,0,0,121.88980002096238
44,GLU,8.472096752192252,,0,0,0,8.472096752192252,4.22878670002775,,0,0,0,4.22878670002775,176.56733397232767,,0,0,0,176.56733397232767,56.69637567122877,,0,0,0,56.69637567122877,29.302621667887667,,0,0,0,29.302621667887667,117.63291951609501,,0,0,0,117.63291951609501
45,SER,7.679869366228217,,0,0,0,7.679869366228217,4.464164418376068,,0,0,0,4.464164418376068,175.43944574872904,,0,0,0,175.43944574872904,58.48357248692418,,0,0,0,58.48357248692418,63.872795769974466,,0,0,0,63.872795769974466,115.37350571718282,,0,0,0,115.37350571718282
46,THR,8.275476293672995,,0,0,0,8.275476293672995,4.454993082273282,,0,0,0,4.454993082273282,174.9879005630869,,0,0,0,174.9879005630869,61.65586765873015,,0,0,0,61.65586765873015,69.28126666940837,,0,0,0,69.28126666940837,116.75187781541236,,0,0,0,116.75187781541236
47,ASP,8.070751427872128,,0,0,0,8.070751427872128,4.680470952564103,,0,0,0,4.680470952564103,175.57582862262183,,0,0,0,175.57582862262183,53.76609917681208,,0,0,0,53.76609917681208,41.67975855572206,,0,0,0,41.67975855572206,123.56142370954046,,0,0,0,123.56142370954046
48,ASP,8.49647990946831,,0,0,0,8.49647990946831,4.617457553510379,,0,0,0,4.617457553510379,176.0085703854923,,0,0,0,176.0085703854923,54.16563987867133,,0,0,0,54.16563987867133,41.39898952709513,,0,0,0,41.39898952709513,121.51704527096237,,0,0,0,121.51704527096237
49,ILE,8.293728618104119,,0,0,0,8.293728618104119,4.0376673413752915,,0,0,0,4.0376673413752915,176.58125375632702,,0,0,0,176.58125375632702,61.52868333929404,,0,0,0,61.52868333929404,38.12664987185037,,0,0,0,38.12664987185037,122.3194278393551,,0,0,0,122.3194278393551
50,THR,8.341312472927074,,0,0,0,8.341312472927074,4.4711481359307355,,0,0,0,4.4711481359307355,174.7835539288822,,0,0,0,174.7835539288822,62.43090950743145,,0,0,0,62.43090950743145,70.02691904150849,,0,0,0,70.02691904150849,119.09643442400932,,0,0,0,119.09643442400932
51,GLY,7.8676079174936175,,0,0,0,7.8676079174936175,3.933061098898324,,0,0,0,3.933061098898324,170.83367516877567,,0,0,0,170.83367516877567,45.21571051607282,,0,0,0,45.21571051607282,,,0,0,0,,109.3141052495116,,0,0,0,109.3141052495116
52,MET,8.620430439887889,,0,0,0,8.620430439887889,5.164019741014541,,0,0,0,5.164019741014541,173.2757313232823,,0,0,0,173.2757313232823,54.129567716477965,,0,0,0,54.129567716477965,35.573359527244975,,0,0,0,35.573359527244975,119.43752268194582,,0,0,0,119.43752268194582
53,TYR,9.056411063331112,,0,0,0,9.056411063331112,5.001299792962593,,0,0,0,5.001299792962593,174.54134730773671,,0,0,0,174.54134730773671,56.474074966361414,,0,0,0,56.474074966361414,39.9125652515096,,0,0,0,39.9125652515096,126.08676070454545,,0,0,0,126.08676070454545
54,LEU,8.989745323698525,,0,0,0,8.989745323698525,4.65713035904096,,0,0,0,4.65713035904096,175.15132766618382,,0,0,0,175.15132766618382,53.37572734592629,,0,0,0,53.37572734592629,41.17265685417915,,0,0,0,41.17265685417915,125.74756548143523,,0,0,0,125.74756548143523
55,ILE,9.244205465634366,,0,0,0,9.244205465634366,5.064962075724276,,0,0,0,5.064962075724276,175.4100443300533,,0,0,0,175.4100443300533,60.31403119623155,,0,0,0,60.31403119623155,40.616213573154624,,0,0,0,40.616213573154624,124.27344035879122,,0,0,0,124.27344035879122
56,ASP,9.052594858613608,,0,0,0,9.052594858613608,5.554576030530581,,0,0,0,5.554576030530581,176.5296194921523,,0,0,0,176.5296194921523,52.60393802097347,,0,0,0,52.60393802097347,43.108974087040735,,0,0,0,43.108974087040735,126.15462842278278,,0,0,0,126.15462842278278
57,ASP,8.908088306243757,,0,0,0,8.908088306243757,4.424541255977356,,0,0,0,4.424541255977356,177.11233207114554,,0,0,0,177.11233207114554,56.023752453024755,,0,0,0,56.023752453024755,39.815670354240204,,0,0,0,39.815670354240204,117.74645973337775,,0,0,0,117.74645973337775
58,GLU,8.033266689915639,,0,0,0,8.033266689915639,4.336211355855256,,0,0,0,4.336211355855256,176.22336166633366,,0,0,0,176.22336166633366,56.61694522270507,,0,0,0,56.61694522270507,29.9567345974248,,0,0,0,29.9567345974248,118.2751323000666,,0,0,0,118.2751323000666
59,GLY,7.731912317149517,,0,0,0,7.731912317149517,4.156365555155955,,0,0,0,4.156365555155955,172.88681228407148,,0,0,0,172.88681228407148,44.46429434987235,,0,0,0,44.46429434987235,,,0,0,0,,108.89632269955045,,0,0,0,108.89632269955045
60,GLU,8.397886239499389,,0,0,0,8.397886239499389,5.33110446081141,,0,0,0,5.33110446081141,175.7274475869686,,0,0,0,175.7274475869686,54.73225253136308,,0,0,0,54.73225253136308,32.44518105901321,,0,0,0,32.44518105901321,121.16174918807305,,0,0,0,121.16174918807305
61,ILE,8.995464469968923,,0,0,0,8.995464469968923,4.484633777919303,,0,0,0,4.484633777919303,174.78325134216894,,0,0,0,174.78325134216894,60.23571769961705,,0,0,0,60.23571769961705,39.901003771639466,,0,0,0,39.901003771639466,124.10065836491842,,0,0,0,124.10065836491842
62,ILE,8.671567262343212,,0,0,0,8.671567262343212,4.808831504445555,,0,0,0,4.808831504445555,175.51752844919525,,0,0,0,175.51752844919525,59.796836520113224,,0,0,0,59.796836520113224,39.445915746148295,,0,0,0,39.445915746148295,126.70441251395827,,0,0,0,126.70441251395827
63,THR,8.846236865034966,,0,0,0,8.846236865034966,4.6746546818126316,,0,0,0,4.6746546818126316,173.9649383007992,,0,0,0,173.9649383007992,60.04676515421245,,0,0,0,60.04676515421245,70.5266863905206,,0,0,0,70.5266863905206,121.72426958632478,,0,0,0,121.72426958632478
64,ARG,8.608127705233656,,0,0,0,8.608127705233656,4.404378894483294,,0,0,0,4.404378894483294,176.45868085681542,,0,0,0,176.45868085681542,56.10266523090243,,0,0,0,56.10266523090243,30.70888839246864,,0,0,0,30.70888839246864,124.32596218126874,,0,0,0,124.32596218126874
65,GLU,8.523930234265734,,0,0,0,8.523930234265734,4.320195759021534,,0,0,0,4.320195759021534,174.94761812410923,,0,0,0,174.94761812410923,56.40699555840826,,0,0,0,56.40699555840826,28.811027579503826,,0,0,0,28.811027579503826,121.12725430576091,,0,0,0,121.12725430576091
66,VAL,8.086593594516593,,0,0,0,8.086593594516593,4.730096493006992,,0,0,0,4.730096493006992,175.37521557801642,,0,0,0,175.37521557801642,61.42206934831835,,0,0,0,61.42206934831835,33.89376962344322,,0,0,0,33.89376962344322,123.17970041419692,,0,0,0,123.17970041419692
67,LYS,8.92483978092463,,0,0,0,8.92483978092463,4.746197842413142,,0,0,0,4.746197842413142,175.33199401130534,,0,0,0,175.33199401130534,54.61263277042957,,0,0,0,54.61263277042957,35.20165527034077,,0,0,0,35.20165527034077,127.32755915834721,,0,0,0,127.32755915834721
68,GLY,8.69403776963037,,0,0,0,8.69403776963037,3.770407040900766,,0,0,0,3.770407040900766,173.71534650962926,,0,0,0,173.71534650962926,45.675436203246754,,0,0,0,45.675436203246754,,,0,0,0,,112.81161950158175,,0,0,0,112.81161950158175
69,LYS,8.694953036557886,,0,0,0,8.694953036557886,4.734702405777556,,0,0,0,4.734702405777556,174.6052087506882,,0,0,0,174.6052087506882,54.422968103407705,,0,0,0,54.422968103407705,34.240313197902104,,0,0,0,34.240313197902104,122.53210498833944,,0,0,0,122.53210498833944
70,PHE,8.858219096092798,,0,0,0,8.858219096092798,5.240494714885115,,0,0,0,5.240494714885115,175.9040999294761,,0,0,0,175.9040999294761,56.71600328858919,,0,0,0,56.71600328858919,40.78992985368521,,0,0,0,40.78992985368521,122.9483687001665,,0,0,0,122.9483687001665
71,ILE,8.924064883660783,,0,0,0,8.924064883660783,4.41054332994783,,0,0,0,4.41054332994783,176.63170861123876,,0,0,0,176.63170861123876,60.30076935413476,,0,0,0,60.30076935413476,39.84762248090798,,0,0,0,39.84762248090798,123.644792134793,,0,0,0,123.644792134793
72,ASN,9.52971355001665,,0,0,0,9.52971355001665,4.505438645268621,,0,0,0,4.505438645268621,175.20578452629036,,0,0,0,175.20578452629036,54.30772625345765,,0,0,0,54.30772625345765,37.821988598706845,,0,0,0,37.821988598706845,127.05137176541791,,0,0,0,127.05137176541791
73,GLY,8.583635332267733,,0,0,0,8.583635332267733,3.877587871650572,,0,0,0,3.877587871650572,173.69541369145855,,0,0,0,173.69541369145855,45.46846385260295,,0,0,0,45.46846385260295,,,0,0,0,,103.65013443574203,,0,0,0,103.65013443574203
74,ARG,7.785119277195027,,0,0,0,7.785119277195027,5.058098786985237,,0,0,0,5.058098786985237,173.55302867415918,,0,0,0,173.55302867415918,52.535099283427684,,0,0,0,52.535099283427684,31.460123476673328,,0,0,0,31.460123476673328,122.05892567055167,,0,0,0,122.05892567055167
75,PRO,,,0,0,0,,3.708053109637585,,0,0,0,3.708053109637585,176.7192214001665,,0,0,0,176.7192214001665,63.382157277450325,,0,0,0,63.382157277450325,31.081346421900324,,0,0,0,31.081346421900324,,,0,0,0,
76,THR,8.84660413992119,,0,0,0,8.84660413992119,4.518019073920524,,0,0,0,4.518019073920524,173.43078139577088,,0,0,0,173.43078139577088,61.70252732457542,,0,0,0,61.70252732457542,70.44918239971695,,0,0,0,70.44918239971695,117.76042983848373,,0,0,0,117.76042983848373
77,ALA,7.774236623021423,,0,0,0,7.774236623021423,5.195962608769009,,0,0,0,5.195962608769009,175.28909063863915,,0,0,0,175.28909063863915,50.959654778044175,,0,0,0,50.959654778044175,22.808918079981133,,0,0,0,22.808918079981133,123.15075468466533,,0,0,0,123.15075468466533
78,ILE,8.63271067964258,,0,0,0,8.63271067964258,4.649503879270729,,0,0,0,4.649503879270729,174.01219847216117,,0,0,0,174.01219847216117,60.077770067277164,,0,0,0,60.077770067277164,40.90975954371739,,0,0,0,40.90975954371739,120.0313921510434,,0,0,0,120.0313921510434
79,GLU,8.99134794967255,,0,0,0,8.99134794967255,5.585268627228328,,0,0,0,5.585268627228328,175.61206611808745,,0,0,0,175.61206611808745,54.163997222677324,,0,0,0,54.163997222677324,32.41568831798202,,0,0,0,32.41568831798202,127.70945261137196,,0,0,0,127.70945261137196
80,ALA,9.549168661555111,,0,0,0,9.549168661555111,5.644739701343102,,0,0,0,5.644739701343102,175.89796947545233,,0,0,0,175.89796947545233,49.793547006432455,,0,0,0,49.793547006432455,23.12549304128094,,0,0,0,23.12549304128094,130.44564999760794,,0,0,0,130.44564999760794
81,THR,8.918153364285715,,0,0,0,8.918153364285715,5.248853343861693,,0,0,0,5.248853343861693,173.86375680932954,,0,0,0,173.86375680932954,61.795917625224774,,0,0,0,61.795917625224774,70.62780686712176,,0,0,0,70.62780686712176,116.14252623683538,,0,0,0,116.14252623683538
82,VAL,9.404655669341768,,0,0,0,9.404655669341768,4.338157789382839,,0,0,0,4.338157789382839,174.68402068349428,,0,0,0,174.68402068349428,61.41089087595183,,0,0,0,61.41089087595183,33.223015517909865,,0,0,0,33.223015517909865,127.9576144603674,,0,0,0,127.9576144603674
83,ILE,8.785755156848706,,0,0,0,8.785755156848706,4.4168876929292935,,0,0,0,4.4168876929292935,175.37749255571097,,0,0,0,175.37749255571097,60.80235509345654,,0,0,0,60.80235509345654,38.766373578160724,,0,0,0,38.766373578160724,127.21584972555777,,0,0,0,127.21584972555777
84,LEU,8.973169828399378,,0,0,0,8.973169828399378,4.769260791086691,,0,0,0,4.769260791086691,177.1295242058497,,0,0,0,177.1295242058497,53.368977785120435,,0,0,0,53.368977785120435,42.03483228695749,,0,0,0,42.03483228695749,129.01171024912864,,0,0,0,129.01171024912864
85,ASN,8.990486507298257,,0,0,0,8.990486507298257,4.845518535531136,,0,0,0,4.845518535531136,174.47465012696748,,0,0,0,174.47465012696748,53.710757521373075,,0,0,0,53.710757521373075,39.61765830637695,,0,0,0,39.61765830637695,121.53199956237096,,0,0,0,121.53199956237096
86,SER,7.782809358624709,,0,0,0,7.782809358624709,4.695152363358863,,0,0,0,4.695152363358863,174.40259453989344,,0,0,0,174.40259453989344,57.46299449579865,,0,0,0,57.46299449579865,65.46714487229993,,0,0,0,65.46714487229993,111.92342194092573,,0,0,0,111.92342194092573
87,GLN,8.918669956743257,,0,0,0,8.918669956743257,4.1391244693056946,,0,0,0,4.1391244693056946,175.40254962087357,,0,0,0,175.40254962087357,59.72678981100566,,0,0,0,59.72678981100566,26.05619457053502,,0,0,0,26.05619457053502,123.66723408210122,,0,0,0,123.66723408210122
88,PRO,,,0,0,0,,4.377882803194028,,0,0,0,4.377882803194028,179.54477259229105,,0,0,0,179.54477259229105,66.12519814247973,,0,0,0,66.12519814247973,30.786874118886672,,0,0,0,30.786874118886672,,,0,0,0,
89,GLU,8.039451637196137,,0,0,0,8.039451637196137,4.136137336882562,,0,0,0,4.136137336882562,179.0779813177045,,0,0,0,179.0779813177045,59.342868346497944,,0,0,0,59.342868346497944,30.057331396203796,,0,0,0,30.057331396203796,119.12015045522811,,0,0,0,119.12015045522811