RESNUM,RESNAME,H_X,H_Y,H_BEST_REF_SCORE,H_BEST_REF_COV,H_BEST_REF_MATCH,H_UCBShift,HA_X,HA_Y,HA_BEST_REF_SCORE,HA_BEST_REF_COV,HA_BEST_REF_MATCH,HA_UCBShift,C_X,C_Y,C_BEST_REF_SCORE,C_BEST_REF_COV,C_BEST_REF_MATCH,C_UCBShift,CA_X,CA_Y,CA_BEST_REF_SCORE,CA_BEST_REF_COV,CA_BEST_REF_MATCH,CA_UCBShift,CB_X,CB_Y,CB_BEST_REF_SCORE,CB_BEST_REF_COV,CB_BEST_REF_MATCH,CB_UCBShift,N_X,N_Y,N_BEST_REF_SCORE,N_BEST_REF_COV,N_BEST_REF_MATCH,N_UCBShift
1,MET,8.286544187551337,,0,0,0,8.286544187551337,4.355921196214896,,0,0,0,4.355921196214896,175.3686797974581,,0,0,0,175.3686797974581,55.86357698451548,,0,0,0,55.86357698451548,32.45791794019869,,0,0,0,32.45791794019869,121.20451751724941,,0,0,0,121.20451751724941
2,ASN,8.581380414108114,,0,0,0,8.581380414108114,4.672336367671218,,0,0,0,4.672336367671218,174.41589759533244,,0,0,0,174.41589759533244,53.12780065935731,,0,0,0,53.12780065935731,39.13103239327894,,0,0,0,39.13103239327894,122.11358276351427,,0,0,0,122.11358276351427
3,GLU,8.208048220862471,,0,0,0,8.208048220862471,4.206551887171162,,0,0,0,4.206551887171162,176.17288024377842,,0,0,0,176.17288024377842,56.508538784959484,,0,0,0,56.508538784959484,29.685041957481406,,0,0,0,29.685041957481406,123.3017743935398,,0,0,0,123.3017743935398
4,LEU,8.233663387634587,,0,0,0,8.233663387634587,4.189129513433788,,0,0,0,4.189129513433788,177.489738592785,,0,0,0,177.489738592785,54.955247441708295,,0,0,0,54.955247441708295,41.94233222180042,,0,0,0,41.94233222180042,125.87331445333555,,0,0,0,125.87331445333555
5,ASP,8.2314676994783,,0,0,0,8.2314676994783,4.628134293620269,,0,0,0,4.628134293620269,176.2682251901876,,0,0,0,176.2682251901876,54.05123760878011,,0,0,0,54.05123760878011,40.35283161303696,,0,0,0,40.35283161303696,124.09618001858142,,0,0,0,124.09618001858142
6,ILE,7.925858295199245,,0,0,0,7.925858295199245,3.994979453574204,,0,0,0,3.994979453574204,176.3328471404762,,0,0,0,176.3328471404762,61.16718817018537,,0,0,0,61.16718817018537,37.7956520527972,,0,0,0,37.7956520527972,122.3266332866578,,0,0,0,122.3266332866578
7,GLN,8.07654101050061,,0,0,0,8.07654101050061,4.182400583502608,,0,0,0,4.182400583502608,175.89869809636474,,0,0,0,175.89869809636474,55.60673806778222,,0,0,0,55.60673806778222,29.083968143600842,,0,0,0,29.083968143600842,126.28307755547786,,0,0,0,126.28307755547786
8,GLN,8.224249830785881,,0,0,0,8.224249830785881,4.067159601370851,,0,0,0,4.067159601370851,175.71747796274835,,0,0,0,175.71747796274835,55.79012787400933,,0,0,0,55.79012787400933,28.68649415205905,,0,0,0,28.68649415205905,123.51577292938173,,0,0,0,123.51577292938173
9,GLU,8.228979844461094,,0,0,0,8.228979844461094,4.200080789699189,,0,0,0,4.200080789699189,175.79405828273948,,0,0,0,175.79405828273948,56.35009471384726,,0,0,0,56.35009471384726,29.1446202013542,,0,0,0,29.1446202013542,123.36966890965701,,0,0,0,123.36966890965701
10,TYR,8.056699887801088,,0,0,0,8.056699887801088,4.270881031909757,,0,0,0,4.270881031909757,175.55404520084917,,0,0,0,175.55404520084917,56.69107809373404,,0,0,0,56.69107809373404,38.566822045510044,,0,0,0,38.566822045510044,123.26797828474858,,0,0,0,123.26797828474858
11,PRO,,,0,0,0,,4.484744407384282,,0,0,0,4.484744407384282,176.02070494494396,,0,0,0,176.02070494494396,64.09505508357753,,0,0,0,64.09505508357753,32.06037915813076,,0,0,0,32.06037915813076,,,0,0,0,
12,PHE,7.322218768731269,,0,0,0,7.322218768731269,5.448043423182373,,0,0,0,5.448043423182373,173.2596141505106,,0,0,0,173.2596141505106,55.87570297167832,,0,0,0,55.87570297167832,41.90081672076813,,0,0,0,41.90081672076813,114.43721319901765,,0,0,0,114.43721319901765
13,THR,8.944642484953935,,0,0,0,8.944642484953935,4.601404953701853,,0,0,0,4.601404953701853,174.12021325596623,,0,0,0,174.12021325596623,60.397250729675875,,0,0,0,60.397250729675875,70.5918461924742,,0,0,0,70.5918461924742,112.74120652390941,,0,0,0,112.74120652390941
14,VAL,8.562378272366523,,0,0,0,8.562378272366523,4.660505154362304,,0,0,0,4.660505154362304,174.73176020651016,,0,0,0,174.73176020651016,61.11940600778111,,0,0,0,61.11940600778111,33.55770886902542,,0,0,0,33.55770886902542,121.6682968481685,,0,0,0,121.6682968481685
15,GLU,8.91089661006216,,0,0,0,8.91089661006216,4.523402351875902,,0,0,0,4.523402351875902,175.59422196477965,,0,0,0,175.59422196477965,55.33884903927739,,0,0,0,55.33884903927739,31.738803023554226,,0,0,0,31.738803023554226,127.1175327438395,,0,0,0,127.1175327438395
16,SER,8.578722397585748,,0,0,0,8.578722397585748,5.288720316699968,,0,0,0,5.288720316699968,174.37977325133755,,0,0,0,174.37977325133755,56.72816897682873,,0,0,0,56.72816897682873,65.39126982422022,,0,0,0,65.39126982422022,117.62895576747142,,0,0,0,117.62895576747142
17,MET,8.517810894849594,,0,0,0,8.517810894849594,4.748311905244756,,0,0,0,4.748311905244756,173.8834626182151,,0,0,0,173.8834626182151,53.76108866456876,,0,0,0,53.76108866456876,32.48792048426019,,0,0,0,32.48792048426019,121.85788315567765,,0,0,0,121.85788315567765
18,PRO,,,0,0,0,,4.4190636742674,,0,0,0,4.4190636742674,176.68336770845266,,0,0,0,176.68336770845266,63.43353165498945,,0,0,0,63.43353165498945,32.02079819855145,,0,0,0,32.02079819855145,,,0,0,0,
19,VAL,8.307897048634697,,0,0,0,8.307897048634697,4.53103325003885,,0,0,0,4.53103325003885,175.91583427525254,,0,0,0,175.91583427525254,60.34246554501055,,0,0,0,60.34246554501055,33.42932313483183,,0,0,0,33.42932313483183,118.9262802993007,,0,0,0,118.9262802993007
20,ALA,8.386773068126319,,0,0,0,8.386773068126319,4.312129410994562,,0,0,0,4.312129410994562,177.6917498464924,,0,0,0,177.6917498464924,52.39126766972472,,0,0,0,52.39126766972472,19.649423723049175,,0,0,0,19.649423723049175,126.26672993822288,,0,0,0,126.26672993822288
21,ASP,8.55727783992674,,0,0,0,8.55727783992674,4.809352058469308,,0,0,0,4.809352058469308,175.3506812391664,,0,0,0,175.3506812391664,54.9191323000111,,0,0,0,54.9191323000111,41.3528726926851,,0,0,0,41.3528726926851,120.03277010505052,,0,0,0,120.03277010505052
22,GLU,8.1044814990787,,0,0,0,8.1044814990787,5.438208867171715,,0,0,0,5.438208867171715,175.5800789065601,,0,0,0,175.5800789065601,55.11107471057831,,0,0,0,55.11107471057831,32.29757812554668,,0,0,0,32.29757812554668,118.92374907368743,,0,0,0,118.92374907368743
23,ILE,9.015416270140971,,0,0,0,9.015416270140971,4.838655722100122,,0,0,0,4.838655722100122,174.40320173557555,,0,0,0,174.40320173557555,59.14632826501831,,0,0,0,59.14632826501831,41.2821456476024,,0,0,0,41.2821456476024,124.7193818985348,,0,0,0,124.7193818985348
24,ALA,8.572775561410811,,0,0,0,8.572775561410811,4.507316308968809,,0,0,0,4.507316308968809,177.79333773796205,,0,0,0,177.79333773796205,51.450148552780554,,0,0,0,51.450148552780554,20.092078072638476,,0,0,0,20.092078072638476,128.39062479557666,,0,0,0,128.39062479557666
25,GLY,8.531349584265735,,0,0,0,8.531349584265735,3.7183217183288937,,0,0,0,3.7183217183288937,175.00821657379842,,0,0,0,175.00821657379842,46.9010885944944,,0,0,0,46.9010885944944,,,0,0,0,,108.0911961539849,,0,0,0,108.0911961539849
26,ASP,8.624499841952492,,0,0,0,8.624499841952492,4.396169997757798,,0,0,0,4.396169997757798,175.3665057918415,,0,0,0,175.3665057918415,56.12545838691309,,0,0,0,56.12545838691309,39.59138505486736,,0,0,0,39.59138505486736,119.39056323072484,,0,0,0,119.39056323072484
27,GLU,7.8448737724775235,,0,0,0,7.8448737724775235,4.33776120529748,,0,0,0,4.33776120529748,175.51609115696525,,0,0,0,175.51609115696525,56.596500746314796,,0,0,0,56.596500746314796,31.515785903235653,,0,0,0,31.515785903235653,121.33320603139639,,0,0,0,121.33320603139639
28,THR,8.440731679159729,,0,0,0,8.440731679159729,5.112486398884449,,0,0,0,5.112486398884449,174.30848226149405,,0,0,0,174.30848226149405,61.435876404589855,,0,0,0,61.435876404589855,70.30205327761682,,0,0,0,70.30205327761682,120.57039477812187,,0,0,0,120.57039477812187
29,VAL,9.325721832345431,,0,0,0,9.325721832345431,4.462635748229548,,0,0,0,4.462635748229548,174.19642845614385,,0,0,0,174.19642845614385,59.83585228982129,,0,0,0,59.83585228982129,34.17506933418804,,0,0,0,34.17506933418804,123.64228184300698,,0,0,0,123.64228184300698
30,GLU,8.570109428010879,,0,0,0,8.570109428010879,4.78831416110001,,0,0,0,4.78831416110001,175.46508825626594,,0,0,0,175.46508825626594,55.33853026723832,,0,0,0,55.33853026723832,30.90032245878011,,0,0,0,30.90032245878011,125.43127794959486,,0,0,0,125.43127794959486
31,ILE,8.987279002969254,,0,0,0,8.987279002969254,4.230428976739927,,0,0,0,4.230428976739927,174.76286178049173,,0,0,0,174.76286178049173,60.22703628363858,,0,0,0,60.22703628363858,39.48982660651016,,0,0,0,39.48982660651016,126.91716940712067,,0,0,0,126.91716940712067
32,ARG,8.887585405422357,,0,0,0,8.887585405422357,4.72823854006549,,0,0,0,4.72823854006549,174.9208740461705,,0,0,0,174.9208740461705,55.790669255039404,,0,0,0,55.790669255039404,31.648894784171382,,0,0,0,31.648894784171382,127.77822273699634,,0,0,0,127.77822273699634
33,LEU,8.874515557686758,,0,0,0,8.874515557686758,5.144852117427018,,0,0,0,5.144852117427018,174.86058984451103,,0,0,0,174.86058984451103,53.2192203456155,,0,0,0,53.2192203456155,44.7204467458597,,0,0,0,44.7204467458597,124.89468420376289,,0,0,0,124.89468420376289
34,GLU,8.824281330325231,,0,0,0,8.824281330325231,5.151846386452436,,0,0,0,5.151846386452436,175.25123907657343,,0,0,0,175.25123907657343,54.5636175451604,,0,0,0,54.5636175451604,32.807959913286716,,0,0,0,32.807959913286716,121.98368697366523,,0,0,0,121.98368697366523
35,ILE,8.908570139022089,,0,0,0,8.908570139022089,4.592794563514264,,0,0,0,4.592794563514264,175.64453571299256,,0,0,0,175.64453571299256,61.03396916616717,,0,0,0,61.03396916616717,38.70239898518148,,0,0,0,38.70239898518148,126.43762506593963,,0,0,0,126.43762506593963
36,LYS,8.893027047674547,,0,0,0,8.893027047674547,4.97299488035298,,0,0,0,4.97299488035298,174.117711749112,,0,0,0,174.117711749112,52.78045143418804,,0,0,0,52.78045143418804,32.9977569943612,,0,0,0,32.9977569943612,129.74952668076924,,0,0,0,129.74952668076924
37,PRO,,,0,0,0,,4.676098178732379,,0,0,0,4.676098178732379,176.40706826345877,,0,0,0,176.40706826345877,63.06418633121878,,0,0,0,63.06418633121878,32.49770251596182,,0,0,0,32.49770251596182,,,0,0,0,
38,SER,8.922542612870464,,0,0,0,8.922542612870464,4.424906962187812,,0,0,0,4.424906962187812,174.30658733404374,,0,0,0,174.30658733404374,59.250302322655116,,0,0,0,59.250302322655116,63.371784268054164,,0,0,0,63.371784268054164,118.05893449775225,,0,0,0,118.05893449775225
39,GLY,8.21923722100122,,0,0,0,8.21923722100122,3.961476693173494,,0,0,0,3.961476693173494,173.06864923251194,,0,0,0,173.06864923251194,44.83293528127983,,0,0,0,44.83293528127983,,,0,0,0,,109.40923920457875,,0,0,0,109.40923920457875
40,ASN,8.124286024986125,,0,0,0,8.124286024986125,4.731837716228217,,0,0,0,4.731837716228217,174.24974858103562,,0,0,0,174.24974858103562,52.80257104580975,,0,0,0,52.80257104580975,37.72089748577533,,0,0,0,37.72089748577533,117.81263951877567,,0,0,0,117.81263951877567
41,PHE,8.011993022804974,,0,0,0,8.011993022804974,4.519577687834388,,0,0,0,4.519577687834388,175.86131494287935,,0,0,0,175.86131494287935,57.58172068018093,,0,0,0,57.58172068018093,38.58610134160284,,0,0,0,38.58610134160284,121.97259721764347,,0,0,0,121.97259721764347
42,ILE,8.087228331984681,,0,0,0,8.087228331984681,3.919077078182928,,0,0,0,3.919077078182928,177.5292023554168,,0,0,0,177.5292023554168,62.313783871928074,,0,0,0,62.313783871928074,37.252048046808746,,0,0,0,37.252048046808746,124.72153113769009,,0,0,0,124.72153113769009
43,GLY,8.794102595576646,,0,0,0,8.794102595576646,3.9821739818598068,,0,0,0,3.9821739818598068,174.67234110601066,,0,0,0,174.67234110601066,45.30199625633811,,0,0,0,45.30199625633811,,,0,0,0,,114.93940728024198,,0,0,0,114.93940728024198
44,THR,7.924350910345211,,0,0,0,7.924350910345211,4.084707367238317,,0,0,0,4.084707367238317,173.82097104398932,,0,0,0,173.82097104398932,63.93372423158508,,0,0,0,63.93372423158508,69.68676724208014,,0,0,0,69.68676724208014,118.165408199556,,0,0,0,118.165408199556
45,VAL,8.203705825696526,,0,0,0,8.203705825696526,4.101236434160284,,0,0,0,4.101236434160284,174.59971022125654,,0,0,0,174.59971022125654,61.46849031025641,,0,0,0,61.46849031025641,33.02831131193251,,0,0,0,33.02831131193251,126.34585460859141,,0,0,0,126.34585460859141
46,TYR,8.379794003635253,,0,0,0,8.379794003635253,5.096868572677323,,0,0,0,5.096868572677323,175.21542686006217,,0,0,0,175.21542686006217,56.75835464804639,,0,0,0,56.75835464804639,41.17267230864136,,0,0,0,41.17267230864136,125.64818001870351,,0,0,0,125.64818001870351
47,THR,9.234206837728937,,0,0,0,9.234206837728937,5.196269641391941,,0,0,0,5.196269641391941,173.57175958749582,,0,0,0,173.57175958749582,59.98522668779553,,0,0,0,59.98522668779553,71.48063687706183,,0,0,0,71.48063687706183,115.81945583341103,,0,0,0,115.81945583341103
48,LEU,9.143293835486736,,0,0,0,9.143293835486736,5.242360705189257,,0,0,0,5.242360705189257,174.50453457898766,,0,0,0,174.50453457898766,53.430353981474084,,0,0,0,53.430353981474084,44.773065316561215,,0,0,0,44.773065316561215,126.42013255067155,,0,0,0,126.42013255067155
49,ARG,9.104645542402043,,0,0,0,9.104645542402043,5.585166376456877,,0,0,0,5.585166376456877,174.84596224953935,,0,0,0,174.84596224953935,53.87506854554889,,0,0,0,53.87506854554889,33.787803121373074,,0,0,0,33.787803121373074,127.24390008957154,,0,0,0,127.24390008957154
50,TYR,8.967652541575092,,0,0,0,8.967652541575092,5.8507937010878015,,0,0,0,5.8507937010878015,173.98381953364412,,0,0,0,173.98381953364412,55.457912626151625,,0,0,0,55.457912626151625,42.27845534030969,,0,0,0,42.27845534030969,125.2793408020757,,0,0,0,125.2793408020757
51,PHE,9.300351156637806,,0,0,0,9.300351156637806,4.78262861025641,,0,0,0,4.78262861025641,172.88844783815074,,0,0,0,172.88844783815074,56.42485731762682,,0,0,0,56.42485731762682,42.96490482063492,,0,0,0,42.96490482063492,125.3707644090687,,0,0,0,125.3707644090687
52,GLN,7.851717305294704,,0,0,0,7.851717305294704,5.090405328121878,,0,0,0,5.090405328121878,173.2987416123876,,0,0,0,173.2987416123876,52.13560862731713,,0,0,0,52.13560862731713,30.52468512880453,,0,0,0,30.52468512880453,127.32578301252636,,0,0,0,127.32578301252636
53,PRO,,,0,0,0,,4.375993201354201,,0,0,0,4.375993201354201,176.56233398841715,,0,0,0,176.56233398841715,64.0629804566267,,0,0,0,64.0629804566267,32.25130222568543,,0,0,0,32.25130222568543,,,0,0,0,
54,ASP,7.812247956820956,,0,0,0,7.812247956820956,4.835723266872017,,0,0,0,4.835723266872017,176.2663740528194,,0,0,0,176.2663740528194,53.84355270270841,,0,0,0,53.84355270270841,44.48021241713842,,0,0,0,44.48021241713842,117.04204757682318,,0,0,0,117.04204757682318
55,GLY,8.507350890814742,,0,0,0,8.507350890814742,4.032729552902653,,0,0,0,4.032729552902653,172.721616700888,,0,0,0,172.721616700888,44.96884501159951,,0,0,0,44.96884501159951,,,0,0,0,,110.60938542119547,,0,0,0,110.60938542119547
56,LYS,8.173615877139527,,0,0,0,8.173615877139527,4.775094883111333,,0,0,0,4.775094883111333,175.54765480183704,,0,0,0,175.54765480183704,55.50423207486958,,0,0,0,55.50423207486958,34.64117340833611,,0,0,0,34.64117340833611,119.42207651676657,,0,0,0,119.42207651676657
57,GLY,8.467989657131756,,0,0,0,8.467989657131756,4.113752710528361,,0,0,0,4.113752710528361,172.6717006537629,,0,0,0,172.6717006537629,45.66023232899878,,0,0,0,45.66023232899878,,,0,0,0,,109.19255480583305,,0,0,0,109.19255480583305
58,SER,8.69504097919303,,0,0,0,8.69504097919303,4.739145265123764,,0,0,0,4.739145265123764,171.84888737263847,,0,0,0,171.84888737263847,57.18715761983017,,0,0,0,57.18715761983017,65.696681856549,,0,0,0,65.696681856549,114.8101896942391,,0,0,0,114.8101896942391
59,LEU,8.810188877666778,,0,0,0,8.810188877666778,5.04630763094128,,0,0,0,5.04630763094128,174.73869315111,,0,0,0,174.73869315111,53.616303366544564,,0,0,0,53.616303366544564,43.98168947873238,,0,0,0,43.98168947873238,126.76119088349428,,0,0,0,126.76119088349428
60,LYS,8.917552374420023,,0,0,0,8.917552374420023,5.145247995321345,,0,0,0,5.145247995321345,175.70020963162946,,0,0,0,175.70020963162946,54.62729965688201,,0,0,0,54.62729965688201,36.63724761030081,,0,0,0,36.63724761030081,126.53628335104895,,0,0,0,126.53628335104895
61,MET,9.065287812254413,,0,0,0,9.065287812254413,4.872943759262959,,0,0,0,4.872943759262959,178.02786585193695,,0,0,0,178.02786585193695,55.39791162266622,,0,0,0,55.39791162266622,32.95640313169608,,0,0,0,32.95640313169608,123.53369710725386,,0,0,0,123.53369710725386
62,GLU,8.771026027605728,,0,0,0,8.771026027605728,4.140541522299922,,0,0,0,4.140541522299922,177.1185548909868,,0,0,0,177.1185548909868,59.67806378247863,,0,0,0,59.67806378247863,29.710397522527472,,0,0,0,29.710397522527472,122.01226211203796,,0,0,0,122.01226211203796
63,ASP,8.213935941469641,,0,0,0,8.213935941469641,4.584586550560551,,0,0,0,4.584586550560551,177.05803011780998,,0,0,0,177.05803011780998,54.168898984715284,,0,0,0,54.168898984715284,40.19472397181153,,0,0,0,40.19472397181153,118.04845295354646,,0,0,0,118.04845295354646
64,GLY,8.118934244172495,,0,0,0,8.118934244172495,3.9886907773282267,,0,0,0,3.9886907773282267,174.2663505325175,,0,0,0,174.2663505325175,45.17013031370296,,0,0,0,45.17013031370296,,,0,0,0,,108.8422406516872,,0,0,0,108.8422406516872
65,THR,8.180632487201688,,0,0,0,8.180632487201688,4.200858799228548,,0,0,0,4.200858799228548,173.68955501324785,,0,0,0,173.68955501324785,63.59049345783106,,0,0,0,63.59049345783106,69.80708393641359,,0,0,0,69.80708393641359,117.86326473311688,,0,0,0,117.86326473311688
66,VAL,8.65925903861694,,0,0,0,8.65925903861694,4.212629794633145,,0,0,0,4.212629794633145,175.55726993539238,,0,0,0,175.55726993539238,62.05091997266622,,0,0,0,62.05091997266622,32.52836863822289,,0,0,0,32.52836863822289,127.22736797775002,,0,0,0,127.22736797775002
67,LEU,8.819836175552226,,0,0,0,8.819836175552226,4.179127615578866,,0,0,0,4.179127615578866,176.75577080493395,,0,0,0,176.75577080493395,54.44636472150072,,0,0,0,54.44636472150072,42.650211381968035,,0,0,0,42.650211381968035,129.0573511875569,,0,0,0,129.0573511875569
68,LYS,8.723722916749916,,0,0,0,8.723722916749916,4.8204660948495945,,0,0,0,4.8204660948495945,174.91655034549342,,0,0,0,174.91655034549342,53.69373982203907,,0,0,0,53.69373982203907,32.69461365863026,,0,0,0,32.69461365863026,124.588383606105,,0,0,0,124.588383606105
69,PRO,,,0,0,0,,4.291467927813853,,0,0,0,4.291467927813853,177.4038181380897,,0,0,0,177.4038181380897,63.774898569275166,,0,0,0,63.774898569275166,31.45936802640138,,0,0,0,31.45936802640138,,,0,0,0,
70,ASN,9.1030894498113,,0,0,0,9.1030894498113,4.275576690925741,,0,0,0,4.275576690925741,174.56563894118102,,0,0,0,174.56563894118102,55.43516951527917,,0,0,0,55.43516951527917,37.716819574636474,,0,0,0,37.716819574636474,115.3170635019647,,0,0,0,115.3170635019647
71,ASP,8.000008902752802,,0,0,0,8.000008902752802,4.654453846336996,,0,0,0,4.654453846336996,174.76037327910979,,0,0,0,174.76037327910979,54.138365774397826,,0,0,0,54.138365774397826,42.68499086544567,,0,0,0,42.68499086544567,121.18721677286602,,0,0,0,121.18721677286602
72,ARG,8.17830610879121,,0,0,0,8.17830610879121,4.919843356665557,,0,0,0,4.919843356665557,175.22704571880342,,0,0,0,175.22704571880342,54.872608123232325,,0,0,0,54.872608123232325,31.53754330010545,,0,0,0,31.53754330010545,121.46835968781218,,0,0,0,121.46835968781218
73,TYR,9.18735285117105,,0,0,0,9.18735285117105,4.7532424150516155,,0,0,0,4.7532424150516155,174.8627637905095,,0,0,0,174.8627637905095,56.75024583412698,,0,0,0,56.75024583412698,40.80737130333,,0,0,0,40.80737130333,122.70959823441558,,0,0,0,122.70959823441558
74,LEU,8.815611793517593,,0,0,0,8.815611793517593,4.425069786657787,,0,0,0,4.425069786657787,176.00187493019757,,0,0,0,176.00187493019757,55.230358116611164,,0,0,0,55.230358116611164,42.632926065689865,,0,0,0,42.632926065689865,125.31099392221667,,0,0,0,125.31099392221667
75,LEU,8.948148472610724,,0,0,0,8.948148472610724,4.40275743991564,,0,0,0,4.40275743991564,176.7539199430847,,0,0,0,176.7539199430847,53.813116904711954,,0,0,0,53.813116904711954,42.1453536508325,,0,0,0,42.1453536508325,126.10328888968255,,0,0,0,126.10328888968255
76,ASN,8.569678460350762,,0,0,0,8.569678460350762,4.758446651076701,,0,0,0,4.758446651076701,174.51889866578975,,0,0,0,174.51889866578975,53.79103368095793,,0,0,0,53.79103368095793,39.00594356430791,,0,0,0,39.00594356430791,121.0993521509657,,0,0,0,121.0993521509657
77,GLU,7.973382001825951,,0,0,0,7.973382001825951,4.470798597649573,,0,0,0,4.470798597649573,175.9905680577256,,0,0,0,175.9905680577256,55.76335940885226,,0,0,0,55.76335940885226,31.465147749067597,,0,0,0,31.465147749067597,119.58071803407704,,0,0,0,119.58071803407704
78,TRP,8.569254897730048,,0,0,0,8.569254897730048,4.543492542146742,,0,0,0,4.543492542146742,175.51573936759905,,0,0,0,175.51573936759905,58.708412843922744,,0,0,0,58.708412843922744,29.536035844266845,,0,0,0,29.536035844266845,120.87156624058719,,0,0,0,120.87156624058719
79,LYS,7.982315989138638,,0,0,0,7.982315989138638,5.125571358924409,,0,0,0,5.125571358924409,175.86427696111664,,0,0,0,175.86427696111664,55.1132295449828,,0,0,0,55.1132295449828,34.18380485976801,,0,0,0,34.18380485976801,119.38224880610501,,0,0,0,119.38224880610501
80,PHE,8.577807727983128,,0,0,0,8.577807727983128,5.021537360700411,,0,0,0,5.021537360700411,172.9115221041514,,0,0,0,172.9115221041514,55.88010774231879,,0,0,0,55.88010774231879,40.22049783899989,,0,0,0,40.22049783899989,119.72709906507936,,0,0,0,119.72709906507936
81,ARG,8.734000372360972,,0,0,0,8.734000372360972,5.219627306188257,,0,0,0,5.219627306188257,174.67791227830503,,0,0,0,174.67791227830503,54.79516436134421,,0,0,0,54.79516436134421,33.02677994910645,,0,0,0,33.02677994910645,120.25611356818737,,0,0,0,120.25611356818737
82,LEU,8.77564766058386,,0,0,0,8.77564766058386,5.203715288217339,,0,0,0,5.203715288217339,175.06429091788766,,0,0,0,175.06429091788766,52.88051681017316,,0,0,0,52.88051681017316,44.93867213407703,,0,0,0,44.93867213407703,122.23784052399267,,0,0,0,122.23784052399267
83,TYR,9.12075151794317,,0,0,0,9.12075151794317,5.322283199278499,,0,0,0,5.322283199278499,175.22189926222666,,0,0,0,175.22189926222666,56.242840485225884,,0,0,0,56.242840485225884,39.792139196065044,,0,0,0,39.792139196065044,121.16037002462537,,0,0,0,121.16037002462537
84,TYR,9.201356216550115,,0,0,0,9.201356216550115,5.218663992429793,,0,0,0,5.218663992429793,173.9333130168054,,0,0,0,173.9333130168054,56.349872778388274,,0,0,0,56.349872778388274,40.77796357190587,,0,0,0,40.77796357190587,125.80090388204573,,0,0,0,125.80090388204573
85,THR,8.746210363697413,,0,0,0,8.746210363697413,4.924371132123432,,0,0,0,4.924371132123432,173.33143795414585,,0,0,0,173.33143795414585,61.48658083629148,,0,0,0,61.48658083629148,69.57385150004995,,0,0,0,69.57385150004995,124.58319504305695,,0,0,0,124.58319504305695
86,SER,8.681138673659675,,0,0,0,8.681138673659675,4.123137133050283,,0,0,0,4.123137133050283,175.2986703602897,,0,0,0,175.2986703602897,58.897763245598846,,0,0,0,58.897763245598846,64.17698255987901,,0,0,0,64.17698255987901,122.44304781490176,,0,0,0,122.44304781490176
87,GLN,8.75406632949828,,0,0,0,8.75406632949828,4.489543317826618,,0,0,0,4.489543317826618,175.61736086713287,,0,0,0,175.61736086713287,55.112854164396715,,0,0,0,55.112854164396715,29.65084391167721,,0,0,0,29.65084391167721,125.11093234057608,,0,0,0,125.11093234057608
88,SER,8.218757006693307,,0,0,0,8.218757006693307,4.606722621384171,,0,0,0,4.606722621384171,174.36343728610277,,0,0,0,174.36343728610277,57.471082442757236,,0,0,0,57.471082442757236,64.79740525831946,,0,0,0,64.79740525831946,115.78207385719281,,0,0,0,115.78207385719281
89,ASP,8.656167745027195,,0,0,0,8.656167745027195,4.515468531163281,,0,0,0,4.515468531163281,177.07753496452438,,0,0,0,177.07753496452438,56.49346740957376,,0,0,0,56.49346740957376,41.04935483233989,,0,0,0,41.04935483233989,123.1855624902653,,0,0,0,123.1855624902653
90,LYS,8.158827458608057,,0,0,0,8.158827458608057,4.465635630819181,,0,0,0,4.465635630819181,176.32817782920966,,0,0,0,176.32817782920966,56.27109156249306,,0,0,0,56.27109156249306,33.69391026434121,,0,0,0,33.69391026434121,116.20188538043068,,0,0,0,116.20188538043068