RESNUM,RESNAME,H_X,H_Y,H_BEST_REF_SCORE,H_BEST_REF_COV,H_BEST_REF_MATCH,H_UCBShift,HA_X,HA_Y,HA_BEST_REF_SCORE,HA_BEST_REF_COV,HA_BEST_REF_MATCH,HA_UCBShift,C_X,C_Y,C_BEST_REF_SCORE,C_BEST_REF_COV,C_BEST_REF_MATCH,C_UCBShift,CA_X,CA_Y,CA_BEST_REF_SCORE,CA_BEST_REF_COV,CA_BEST_REF_MATCH,CA_UCBShift,CB_X,CB_Y,CB_BEST_REF_SCORE,CB_BEST_REF_COV,CB_BEST_REF_MATCH,CB_UCBShift,N_X,N_Y,N_BEST_REF_SCORE,N_BEST_REF_COV,N_BEST_REF_MATCH,N_UCBShift
1,MET,8.332044496092795,,0,0,0,8.332044496092795,4.405378113392163,,0,0,0,4.405378113392163,174.88165325284717,,0,0,0,174.88165325284717,55.2261691021312,,0,0,0,55.2261691021312,32.44097126384726,,0,0,0,32.44097126384726,121.155501959546,,0,0,0,121.155501959546
2,GLU,8.4500151999112,,0,0,0,8.4500151999112,4.223207434601509,,0,0,0,4.223207434601509,176.21826120902986,,0,0,0,176.21826120902986,56.54944780912421,,0,0,0,56.54944780912421,29.79035321860917,,0,0,0,29.79035321860917,122.72449582589077,,0,0,0,122.72449582589077
3,LYS,8.319475438827839,,0,0,0,8.319475438827839,4.2464959992035745,,0,0,0,4.2464959992035745,176.04364403680762,,0,0,0,176.04364403680762,56.0538036446276,,0,0,0,56.0538036446276,32.96309753494284,,0,0,0,32.96309753494284,124.03624530370186,,0,0,0,124.03624530370186
4,ALA,8.19016653862804,,0,0,0,8.19016653862804,4.26374003531191,,0,0,0,4.26374003531191,177.3721676313298,,0,0,0,177.3721676313298,52.33717335507271,,0,0,0,52.33717335507271,19.16360238855034,,0,0,0,19.16360238855034,126.75641521907536,,0,0,0,126.75641521907536
5,MET,8.454439428088579,,0,0,0,8.454439428088579,4.707062528424354,,0,0,0,4.707062528424354,174.7334613630203,,0,0,0,174.7334613630203,53.833912577472525,,0,0,0,53.833912577472525,32.47306136529581,,0,0,0,32.47306136529581,122.19894387865469,,0,0,0,122.19894387865469
6,PRO,,,0,0,0,,4.487400934848485,,0,0,0,4.487400934848485,176.87233356940837,,0,0,0,176.87233356940837,62.817178149644796,,0,0,0,62.817178149644796,32.0876013446387,,0,0,0,32.0876013446387,,,0,0,0,
7,GLU,8.426391518642468,,0,0,0,8.426391518642468,4.111960819058719,,0,0,0,4.111960819058719,176.13055327771673,,0,0,0,176.13055327771673,57.052891054218,,0,0,0,57.052891054218,29.724180483399934,,0,0,0,29.724180483399934,121.65787047208347,,0,0,0,121.65787047208347
8,SER,8.28185499930625,,0,0,0,8.28185499930625,4.600883303263403,,0,0,0,4.600883303263403,174.1427922309246,,0,0,0,174.1427922309246,58.11099654753024,,0,0,0,58.11099654753024,63.862962516699966,,0,0,0,63.862962516699966,118.6524971089355,,0,0,0,118.6524971089355
9,PHE,9.103866427478078,,0,0,0,9.103866427478078,4.534090611488511,,0,0,0,4.534090611488511,174.92445010741483,,0,0,0,174.92445010741483,57.844058504878454,,0,0,0,57.844058504878454,40.31023907646798,,0,0,0,40.31023907646798,123.38717635696526,,0,0,0,123.38717635696526
10,VAL,8.359873575985125,,0,0,0,8.359873575985125,5.001875741946942,,0,0,0,5.001875741946942,175.58642221335887,,0,0,0,175.58642221335887,60.74081981045066,,0,0,0,60.74081981045066,33.748756226651125,,0,0,0,33.748756226651125,122.81309393428793,,0,0,0,122.81309393428793
11,VAL,9.346223109407259,,0,0,0,9.346223109407259,4.374945815540015,,0,0,0,4.374945815540015,174.77121970139305,,0,0,0,174.77121970139305,61.40880368986569,,0,0,0,61.40880368986569,33.79942134153069,,0,0,0,33.79942134153069,128.31959856688866,,0,0,0,128.31959856688866
12,ARG,8.622592582439783,,0,0,0,8.622592582439783,5.211124334620935,,0,0,0,5.211124334620935,175.5640629957154,,0,0,0,175.5640629957154,54.825407935153734,,0,0,0,54.825407935153734,32.589643734332334,,0,0,0,32.589643734332334,127.18918686598401,,0,0,0,127.18918686598401
13,ARG,8.805244522344323,,0,0,0,8.805244522344323,4.745251498357198,,0,0,0,4.745251498357198,174.14093756430236,,0,0,0,174.14093756430236,53.92747798817294,,0,0,0,53.92747798817294,34.324477388611385,,0,0,0,34.324477388611385,123.56658472278832,,0,0,0,123.56658472278832
14,GLU,8.609434453607504,,0,0,0,8.609434453607504,5.334663670790319,,0,0,0,5.334663670790319,175.698185498335,,0,0,0,175.698185498335,55.01270851993007,,0,0,0,55.01270851993007,32.327206096614496,,0,0,0,32.327206096614496,121.74333016389721,,0,0,0,121.74333016389721
15,ALA,9.024006667754469,,0,0,0,9.024006667754469,4.779086835708736,,0,0,0,4.779086835708736,175.24506439456655,,0,0,0,175.24506439456655,50.6476802091242,,0,0,0,50.6476802091242,22.368510003069154,,0,0,0,22.368510003069154,125.84248366800422,,0,0,0,125.84248366800422
16,HIS,8.815316613530914,,0,0,0,8.815316613530914,4.963698765134865,,0,0,0,4.963698765134865,174.57488108996557,,0,0,0,174.57488108996557,55.73627004263514,,0,0,0,55.73627004263514,30.288046795349096,,0,0,0,30.288046795349096,121.13613280851371,,0,0,0,121.13613280851371
17,LEU,9.018942554334554,,0,0,0,9.018942554334554,4.710131768725718,,0,0,0,4.710131768725718,176.54470444081474,,0,0,0,176.54470444081474,53.55634934242424,,0,0,0,53.55634934242424,43.180002558397156,,0,0,0,43.180002558397156,126.02993927087357,,0,0,0,126.02993927087357
18,ALA,8.77864233058608,,0,0,0,8.77864233058608,4.365952417704518,,0,0,0,4.365952417704518,176.46456268365523,,0,0,0,176.46456268365523,52.686158817948716,,0,0,0,52.686158817948716,18.33927197766123,,0,0,0,18.33927197766123,125.52767858940504,,0,0,0,125.52767858940504
19,ALA,7.577567961322011,,0,0,0,7.577567961322011,4.684764696808747,,0,0,0,4.684764696808747,174.28550052130646,,0,0,0,174.28550052130646,50.04618028070263,,0,0,0,50.04618028070263,19.93842535028305,,0,0,0,19.93842535028305,121.93471641646131,,0,0,0,121.93471641646131
20,PRO,,,0,0,0,,4.568848764507715,,0,0,0,4.568848764507715,172.31713361913089,,0,0,0,172.31713361913089,61.50735462017427,,0,0,0,61.50735462017427,31.10079503183483,,0,0,0,31.10079503183483,,,0,0,0,
21,PRO,,,0,0,0,,4.325197192612943,,0,0,0,4.325197192612943,178.4272708876235,,0,0,0,178.4272708876235,65.7342412513431,,0,0,0,65.7342412513431,31.65722242536353,,0,0,0,31.65722242536353,,,0,0,0,
22,ALA,8.37588971987457,,0,0,0,8.37588971987457,4.072515227214453,,0,0,0,4.072515227214453,180.7265708815518,,0,0,0,180.7265708815518,55.35976803197913,,0,0,0,55.35976803197913,18.11202096056166,,0,0,0,18.11202096056166,118.54033764082584,,0,0,0,118.54033764082584
23,ALA,7.837718276479077,,0,0,0,7.837718276479077,4.232415253635254,,0,0,0,4.232415253635254,180.14097531724389,,0,0,0,180.14097531724389,54.693780213214566,,0,0,0,54.693780213214566,18.501343436951938,,0,0,0,18.501343436951938,121.47171167453102,,0,0,0,121.47171167453102
24,VAL,8.093271715523365,,0,0,0,8.093271715523365,3.517218170021646,,0,0,0,3.517218170021646,177.55492319179154,,0,0,0,177.55492319179154,66.90831270619381,,0,0,0,66.90831270619381,31.5677570021645,,0,0,0,31.5677570021645,119.05892438003109,,0,0,0,119.05892438003109
25,PHE,9.060992674819625,,0,0,0,9.060992674819625,3.9358336649822396,,0,0,0,3.9358336649822396,177.82385068734044,,0,0,0,177.82385068734044,62.115599664191365,,0,0,0,62.115599664191365,39.26922168354424,,0,0,0,39.26922168354424,120.2115933420635,,0,0,0,120.2115933420635
26,ALA,8.27843544946165,,0,0,0,8.27843544946165,4.356385984976135,,0,0,0,4.356385984976135,180.19643611471307,,0,0,0,180.19643611471307,54.83247215263625,,0,0,0,54.83247215263625,18.45570963974914,,0,0,0,18.45570963974914,121.74958779282385,,0,0,0,121.74958779282385
27,LEU,8.211389666616716,,0,0,0,8.211389666616716,4.217262737068487,,0,0,0,4.217262737068487,178.8279431200355,,0,0,0,178.8279431200355,57.379833920745924,,0,0,0,57.379833920745924,41.686943656482406,,0,0,0,41.686943656482406,117.19948503429347,,0,0,0,117.19948503429347
28,MET,8.02278676032856,,0,0,0,8.02278676032856,4.425056954173604,,0,0,0,4.425056954173604,177.16745816136088,,0,0,0,177.16745816136088,58.111692102125645,,0,0,0,58.111692102125645,33.51842863690199,,0,0,0,33.51842863690199,115.58982691948606,,0,0,0,115.58982691948606
29,THR,7.831327488816739,,0,0,0,7.831327488816739,4.248059772979798,,0,0,0,4.248059772979798,174.94893589431678,,0,0,0,174.94893589431678,63.00195289252969,,0,0,0,63.00195289252969,70.24750512705627,,0,0,0,70.24750512705627,107.80385678612498,,0,0,0,107.80385678612498
30,ASP,8.13983774043179,,0,0,0,8.13983774043179,5.0400153565434564,,0,0,0,5.0400153565434564,175.13473807596293,,0,0,0,175.13473807596293,51.90188582772783,,0,0,0,51.90188582772783,42.232208088317236,,0,0,0,42.232208088317236,123.68069703483184,,0,0,0,123.68069703483184
31,PRO,,,0,0,0,,4.105099331265956,,0,0,0,4.105099331265956,178.09647053988235,,0,0,0,178.09647053988235,65.45923782743922,,0,0,0,65.45923782743922,32.147373243617494,,0,0,0,32.147373243617494,,,0,0,0,
32,GLU,8.915599231596183,,0,0,0,8.915599231596183,4.00499772882673,,0,0,0,4.00499772882673,179.07168628917748,,0,0,0,179.07168628917748,59.8623797939394,,0,0,0,59.8623797939394,29.06085667173937,,0,0,0,29.06085667173937,116.34520768828395,,0,0,0,116.34520768828395
33,LYS,7.799358186363635,,0,0,0,7.799358186363635,4.218725068137418,,0,0,0,4.218725068137418,179.24211945268064,,0,0,0,179.24211945268064,58.67353575933511,,0,0,0,58.67353575933511,32.814360253529806,,0,0,0,32.814360253529806,119.7949435428516,,0,0,0,119.7949435428516
34,ILE,8.368712334482185,,0,0,0,8.368712334482185,3.875802034546009,,0,0,0,3.875802034546009,177.78885381703853,,0,0,0,177.78885381703853,64.76970042582973,,0,0,0,64.76970042582973,38.672750624309025,,0,0,0,38.672750624309025,121.75568276194362,,0,0,0,121.75568276194362
35,LEU,8.1940789003663,,0,0,0,8.1940789003663,4.04797451048951,,0,0,0,4.04797451048951,178.27757211697747,,0,0,0,178.27757211697747,56.487781336752136,,0,0,0,56.487781336752136,41.31705602361527,,0,0,0,41.31705602361527,117.18831391842602,,0,0,0,117.18831391842602
36,ARG,7.803519040426241,,0,0,0,7.803519040426241,4.196736042776668,,0,0,0,4.196736042776668,177.27613941946944,,0,0,0,177.27613941946944,58.12803459760795,,0,0,0,58.12803459760795,30.060385677833278,,0,0,0,30.060385677833278,117.42503050794761,,0,0,0,117.42503050794761
37,TRP,7.990225214124764,,0,0,0,7.990225214124764,4.860459004023753,,0,0,0,4.860459004023753,174.6880080236763,,0,0,0,174.6880080236763,57.394717068326116,,0,0,0,57.394717068326116,31.80773186644467,,0,0,0,31.80773186644467,114.93226017586302,,0,0,0,114.93226017586302
38,MET,7.951518976823176,,0,0,0,7.951518976823176,4.49512570990121,,0,0,0,4.49512570990121,174.52170896264292,,0,0,0,174.52170896264292,54.97942571697747,,0,0,0,54.97942571697747,35.34621207658453,,0,0,0,35.34621207658453,121.11328726351425,,0,0,0,121.11328726351425
39,GLY,8.137124970873572,,0,0,0,8.137124970873572,3.92612390942946,,0,0,0,3.92612390942946,174.25081701189367,,0,0,0,174.25081701189367,44.604779056077255,,0,0,0,44.604779056077255,,,0,0,0,,112.58567517364857,,0,0,0,112.58567517364857
40,THR,8.616144271700522,,0,0,0,8.616144271700522,4.335934890367965,,0,0,0,4.335934890367965,174.9494638044067,,0,0,0,174.9494638044067,62.28290225929626,,0,0,0,62.28290225929626,69.79945885386836,,0,0,0,69.79945885386836,111.2167239031524,,0,0,0,111.2167239031524
41,GLU,7.687080973970474,,0,0,0,7.687080973970474,4.435734327231102,,0,0,0,4.435734327231102,174.35929135145966,,0,0,0,174.35929135145966,55.385361378560326,,0,0,0,55.385361378560326,33.08615378995449,,0,0,0,33.08615378995449,121.42970454205795,,0,0,0,121.42970454205795
42,ALA,8.726129781762682,,0,0,0,8.726129781762682,4.9838671436063935,,0,0,0,4.9838671436063935,175.22367576819846,,0,0,0,175.22367576819846,51.37199171271506,,0,0,0,51.37199171271506,21.993903537878793,,0,0,0,21.993903537878793,126.82939641980796,,0,0,0,126.82939641980796
43,GLU,8.7824316004662,,0,0,0,8.7824316004662,4.513825775413475,,0,0,0,4.513825775413475,174.190808534238,,0,0,0,174.190808534238,55.02938820160395,,0,0,0,55.02938820160395,31.566969526762126,,0,0,0,31.566969526762126,121.88835578302253,,0,0,0,121.88835578302253
44,VAL,8.567196979670328,,0,0,0,8.567196979670328,5.10337127063492,,0,0,0,5.10337127063492,175.06681977233322,,0,0,0,175.06681977233322,59.4995007983461,,0,0,0,59.4995007983461,35.4594458539294,,0,0,0,35.4594458539294,123.5397408999112,,0,0,0,123.5397408999112
45,GLU,8.777091782967032,,0,0,0,8.777091782967032,4.547965574098124,,0,0,0,4.547965574098124,174.48264364156955,,0,0,0,174.48264364156955,53.05843603825064,,0,0,0,53.05843603825064,30.52615954985015,,0,0,0,30.52615954985015,126.80942807400933,,0,0,0,126.80942807400933
46,PRO,,,0,0,0,,3.6621311264707526,,0,0,0,3.6621311264707526,175.0689342388667,,0,0,0,175.0689342388667,62.34750711101676,,0,0,0,62.34750711101676,29.423237107492508,,0,0,0,29.423237107492508,,,0,0,0,
47,GLU,8.269351761804861,,0,0,0,8.269351761804861,4.5605091441031185,,0,0,0,4.5605091441031185,174.5098125525308,,0,0,0,174.5098125525308,53.276096500888,,0,0,0,53.276096500888,30.68202045806416,,0,0,0,30.68202045806416,121.87253894466645,,0,0,0,121.87253894466645
48,PRO,,,0,0,0,,4.221733070587746,,0,0,0,4.221733070587746,177.40526845907428,,0,0,0,177.40526845907428,64.19906323306694,,0,0,0,64.19906323306694,31.450306513214564,,0,0,0,31.450306513214564,,,0,0,0,
49,GLY,9.4439511996892,,0,0,0,9.4439511996892,4.03248133487346,,0,0,0,4.03248133487346,175.26269005944056,,0,0,0,175.26269005944056,45.28976437418692,,0,0,0,45.28976437418692,,,0,0,0,,114.42097593530357,,0,0,0,114.42097593530357
50,GLY,8.32257165141525,,0,0,0,8.32257165141525,4.12302844064269,,0,0,0,4.12302844064269,172.96102042841048,,0,0,0,172.96102042841048,44.95187757871573,,0,0,0,44.95187757871573,,,0,0,0,,108.53596483023088,,0,0,0,108.53596483023088
51,LEU,8.830521512737263,,0,0,0,8.830521512737263,4.648271567371518,,0,0,0,4.648271567371518,175.09073884504937,,0,0,0,175.09073884504937,55.41500871738262,,0,0,0,55.41500871738262,43.37862154009879,,0,0,0,43.37862154009879,124.1404280992563,,0,0,0,124.1404280992563
52,TYR,9.261936806088356,,0,0,0,9.261936806088356,4.791401523254524,,0,0,0,4.791401523254524,173.3422301789988,,0,0,0,173.3422301789988,57.12605318836164,,0,0,0,57.12605318836164,40.30035872521922,,0,0,0,40.30035872521922,128.23107744845154,,0,0,0,128.23107744845154
53,LEU,8.899863246614498,,0,0,0,8.899863246614498,5.0899432378787886,,0,0,0,5.0899432378787886,174.57972602168385,,0,0,0,174.57972602168385,53.53964466060606,,0,0,0,53.53964466060606,45.04734605786436,,0,0,0,45.04734605786436,129.0055302208569,,0,0,0,129.0055302208569
54,VAL,9.187055305488954,,0,0,0,9.187055305488954,4.518862494949495,,0,0,0,4.518862494949495,174.19858810999557,,0,0,0,174.19858810999557,60.32235087551893,,0,0,0,60.32235087551893,35.30607938044733,,0,0,0,35.30607938044733,126.63799287722279,,0,0,0,126.63799287722279
55,ASN,8.997928433621935,,0,0,0,8.997928433621935,4.71822302933178,,0,0,0,4.71822302933178,175.7311873673604,,0,0,0,175.7311873673604,51.960527934565434,,0,0,0,51.960527934565434,38.615956896941945,,0,0,0,38.615956896941945,125.83677450561106,,0,0,0,125.83677450561106
56,VAL,8.482347119425018,,0,0,0,8.482347119425018,3.8615490937950936,,0,0,0,3.8615490937950936,176.10627121769343,,0,0,0,176.10627121769343,64.49512409773006,,0,0,0,64.49512409773006,32.55953096865912,,0,0,0,32.55953096865912,125.47816409816295,,0,0,0,125.47816409816295
57,THR,7.877809015434566,,0,0,0,7.877809015434566,4.520952760911311,,0,0,0,4.520952760911311,175.48309974360083,,0,0,0,175.48309974360083,60.9304781582695,,0,0,0,60.9304781582695,69.82555748174603,,0,0,0,69.82555748174603,107.86018554717505,,0,0,0,107.86018554717505
58,GLY,8.669829554773004,,0,0,0,8.669829554773004,3.923324618983795,,0,0,0,3.923324618983795,174.44348630989566,,0,0,0,174.44348630989566,45.94326737723943,,0,0,0,45.94326737723943,,,0,0,0,,111.45184689082585,,0,0,0,111.45184689082585
59,ALA,7.880377422555223,,0,0,0,7.880377422555223,4.464921388350539,,0,0,0,4.464921388350539,176.89414771835388,,0,0,0,176.89414771835388,52.305333632190035,,0,0,0,52.305333632190035,20.795480446681097,,0,0,0,20.795480446681097,122.94752213521478,,0,0,0,122.94752213521478
60,ARG,7.573907818054168,,0,0,0,7.573907818054168,4.643898208291708,,0,0,0,4.643898208291708,174.71246870419026,,0,0,0,174.71246870419026,55.196932848268396,,0,0,0,55.196932848268396,31.961539098984346,,0,0,0,31.961539098984346,119.23575552182817,,0,0,0,119.23575552182817
61,PHE,8.916742931113333,,0,0,0,8.916742931113333,4.773575709756909,,0,0,0,4.773575709756909,174.72038590846932,,0,0,0,174.72038590846932,57.726087555222556,,0,0,0,57.726087555222556,40.34286303552004,,0,0,0,40.34286303552004,123.0348743591131,,0,0,0,123.0348743591131
62,ALA,9.215985682267732,,0,0,0,9.215985682267732,4.555854055772007,,0,0,0,4.555854055772007,175.71616699461651,,0,0,0,175.71616699461651,50.91304825099345,,0,0,0,50.91304825099345,19.11204277797203,,0,0,0,19.11204277797203,128.5182144410756,,0,0,0,128.5182144410756
63,ARG,8.772269583438785,,0,0,0,8.772269583438785,5.3605113260017765,,0,0,0,5.3605113260017765,175.4563692235154,,0,0,0,175.4563692235154,54.24571673377733,,0,0,0,54.24571673377733,33.340892077816626,,0,0,0,33.340892077816626,125.41175057025197,,0,0,0,125.41175057025197
64,GLY,8.988755008780108,,0,0,0,8.988755008780108,4.213718111854812,,0,0,0,4.213718111854812,172.62907681650572,,0,0,0,172.62907681650572,45.66047910997891,,0,0,0,45.66047910997891,,,0,0,0,,112.45914749350094,,0,0,0,112.45914749350094
65,SER,8.702588121023421,,0,0,0,8.702588121023421,5.4129678190975685,,0,0,0,5.4129678190975685,174.10450977500832,,0,0,0,174.10450977500832,57.258008057664554,,0,0,0,57.258008057664554,65.8998092924076,,0,0,0,65.8998092924076,115.56870174892885,,0,0,0,115.56870174892885
66,PHE,9.523263225174826,,0,0,0,9.523263225174826,4.623433061277611,,0,0,0,4.623433061277611,175.6858906878455,,0,0,0,175.6858906878455,59.99449965571651,,0,0,0,59.99449965571651,39.365419331307585,,0,0,0,39.365419331307585,124.5674554586358,,0,0,0,124.5674554586358
67,ARG,9.00097853857254,,0,0,0,9.00097853857254,4.517408835347985,,0,0,0,4.517408835347985,176.51429981312023,,0,0,0,176.51429981312023,56.89459212221112,,0,0,0,56.89459212221112,31.37361044040404,,0,0,0,31.37361044040404,125.04666873009768,,0,0,0,125.04666873009768
68,GLU,8.550486155966256,,0,0,0,8.550486155966256,4.622901817510267,,0,0,0,4.622901817510267,174.34153973242869,,0,0,0,174.34153973242869,56.02254544198024,,0,0,0,56.02254544198024,33.19359699763015,,0,0,0,33.19359699763015,118.97860062917638,,0,0,0,118.97860062917638
69,VAL,8.706106944744144,,0,0,0,8.706106944744144,4.674021268997669,,0,0,0,4.674021268997669,174.3489290279776,,0,0,0,174.3489290279776,62.39654756537352,,0,0,0,62.39654756537352,34.03124255944611,,0,0,0,34.03124255944611,124.90568312132868,,0,0,0,124.90568312132868
70,VAL,9.413262412853813,,0,0,0,9.413262412853813,4.611438311921412,,0,0,0,4.611438311921412,174.2409850554612,,0,0,0,174.2409850554612,59.14554904317904,,0,0,0,59.14554904317904,33.749529234387836,,0,0,0,33.749529234387836,128.82907304380063,,0,0,0,128.82907304380063
71,PRO,,,0,0,0,,3.7994299179598183,,0,0,0,3.7994299179598183,176.73944327789988,,0,0,0,176.73944327789988,64.10071693408813,,0,0,0,64.10071693408813,31.577965673254525,,0,0,0,31.577965673254525,,,0,0,0,
72,VAL,7.278765993006992,,0,0,0,7.278765993006992,3.7536391885864138,,0,0,0,3.7536391885864138,175.30810913350538,,0,0,0,175.30810913350538,63.82514669025974,,0,0,0,63.82514669025974,31.600414587773336,,0,0,0,31.600414587773336,115.94178348512044,,0,0,0,115.94178348512044
73,HIS,8.20985703118548,,0,0,0,8.20985703118548,4.7965017250305255,,0,0,0,4.7965017250305255,174.54332033580863,,0,0,0,174.54332033580863,57.372852502891554,,0,0,0,57.372852502891554,31.380381987434788,,0,0,0,31.380381987434788,116.85678483978243,,0,0,0,116.85678483978243
74,ARG,8.09791015030525,,0,0,0,8.09791015030525,5.223588204251304,,0,0,0,5.223588204251304,173.8453790069264,,0,0,0,173.8453790069264,55.86624114382839,,0,0,0,55.86624114382839,34.00850472120102,,0,0,0,34.00850472120102,120.59551442691753,,0,0,0,120.59551442691753
75,LEU,9.211506174797425,,0,0,0,9.211506174797425,5.365882679104229,,0,0,0,5.365882679104229,175.0684801397658,,0,0,0,175.0684801397658,53.70321781989122,,0,0,0,53.70321781989122,45.81223036110001,,0,0,0,45.81223036110001,125.45118213386058,,0,0,0,125.45118213386058
76,ALA,9.208819743817294,,0,0,0,9.208819743817294,5.433182127433678,,0,0,0,5.433182127433678,175.9463656364136,,0,0,0,175.9463656364136,50.14642813658009,,0,0,0,50.14642813658009,21.55598888510934,,0,0,0,21.55598888510934,124.15284521949162,,0,0,0,124.15284521949162
77,TYR,8.743799728366078,,0,0,0,8.743799728366078,5.433444054972805,,0,0,0,5.433444054972805,173.35630393556443,,0,0,0,173.35630393556443,55.27636688936619,,0,0,0,55.27636688936619,41.35542698587523,,0,0,0,41.35542698587523,119.96855664202464,,0,0,0,119.96855664202464
78,SER,9.001125695643246,,0,0,0,9.001125695643246,4.921688110939061,,0,0,0,4.921688110939061,174.20538308390496,,0,0,0,174.20538308390496,57.99881351285381,,0,0,0,57.99881351285381,64.43036361409702,,0,0,0,64.43036361409702,117.11422433876125,,0,0,0,117.11422433876125
79,PHE,9.322157059357309,,0,0,0,9.322157059357309,4.849320917371517,,0,0,0,4.849320917371517,173.36956276905318,,0,0,0,173.36956276905318,56.78980200066045,,0,0,0,56.78980200066045,42.7914491923965,,0,0,0,42.7914491923965,123.44105032516372,,0,0,0,123.44105032516372
80,GLY,6.809112901409701,,0,0,0,6.809112901409701,4.009022112193362,,0,0,0,4.009022112193362,171.67100024829614,,0,0,0,171.67100024829614,45.30754693002553,,0,0,0,45.30754693002553,,,0,0,0,,110.6069744464258,,0,0,0,110.6069744464258
81,TRP,8.809700274492174,,0,0,0,8.809700274492174,4.9587299142857155,,0,0,0,4.9587299142857155,176.6806760223998,,0,0,0,176.6806760223998,56.738663087162834,,0,0,0,56.738663087162834,30.093574141802645,,0,0,0,30.093574141802645,121.178537943895,,0,0,0,121.178537943895
82,ASP,9.13757642032412,,0,0,0,9.13757642032412,4.399978015820291,,0,0,0,4.399978015820291,177.2786975304418,,0,0,0,177.2786975304418,56.21096984690865,,0,0,0,56.21096984690865,41.15009703260073,,0,0,0,41.15009703260073,125.04042582878789,,0,0,0,125.04042582878789
83,GLY,8.857545243573094,,0,0,0,8.857545243573094,3.9757691310966803,,0,0,0,3.9757691310966803,174.2286382696026,,0,0,0,174.2286382696026,45.51486783744589,,0,0,0,45.51486783744589,,,0,0,0,,113.49063900816405,,0,0,0,113.49063900816405
84,SER,8.00696103949384,,0,0,0,8.00696103949384,4.5856931816350315,,0,0,0,4.5856931816350315,175.14675828845597,,0,0,0,175.14675828845597,57.83076192446442,,0,0,0,57.83076192446442,63.811671327894324,,0,0,0,63.811671327894324,114.98962582136197,,0,0,0,114.98962582136197
85,GLU,8.8698689500444,,0,0,0,8.8698689500444,4.175638504206904,,0,0,0,4.175638504206904,176.98794586308136,,0,0,0,176.98794586308136,58.203670793345545,,0,0,0,58.203670793345545,29.80323455847486,,0,0,0,29.80323455847486,125.93477966101676,,0,0,0,125.93477966101676
86,VAL,7.898499214424464,,0,0,0,7.898499214424464,3.999859077411477,,0,0,0,3.999859077411477,176.21768109484407,,0,0,0,176.21768109484407,63.82688504729715,,0,0,0,63.82688504729715,32.932126263608616,,0,0,0,32.932126263608616,118.3455043041403,,0,0,0,118.3455043041403
87,VAL,8.03970372031302,,0,0,0,8.03970372031302,4.586513562620713,,0,0,0,4.586513562620713,173.6467849363359,,0,0,0,173.6467849363359,58.69968945467865,,0,0,0,58.69968945467865,32.14108466961927,,0,0,0,32.14108466961927,119.93930075164835,,0,0,0,119.93930075164835
88,PRO,,,0,0,0,,4.748243675607726,,0,0,0,4.748243675607726,171.02973216720503,,0,0,0,171.02973216720503,61.46672875888001,,0,0,0,61.46672875888001,31.111413978460426,,0,0,0,31.111413978460426,,,0,0,0,
89,PRO,,,0,0,0,,4.04962716447164,,0,0,0,4.04962716447164,177.70183522910978,,0,0,0,177.70183522910978,64.22185954729714,,0,0,0,64.22185954729714,31.51455618704629,,0,0,0,31.51455618704629,,,0,0,0,
90,GLY,8.73712827999778,,0,0,0,8.73712827999778,3.969530182836607,,0,0,0,3.969530182836607,175.13482802091244,,0,0,0,175.13482802091244,45.45365011258186,,0,0,0,45.45365011258186,,,0,0,0,,113.78432421931957,,0,0,0,113.78432421931957
91,SER,8.315842966749917,,0,0,0,8.315842966749917,4.459650938189588,,0,0,0,4.459650938189588,174.33483432294926,,0,0,0,174.33483432294926,59.86179171335886,,0,0,0,59.86179171335886,64.52919717727828,,0,0,0,64.52919717727828,115.12570449988345,,0,0,0,115.12570449988345