RESNUM,RESNAME,H_X,H_Y,H_BEST_REF_SCORE,H_BEST_REF_COV,H_BEST_REF_MATCH,H_UCBShift,HA_X,HA_Y,HA_BEST_REF_SCORE,HA_BEST_REF_COV,HA_BEST_REF_MATCH,HA_UCBShift,C_X,C_Y,C_BEST_REF_SCORE,C_BEST_REF_COV,C_BEST_REF_MATCH,C_UCBShift,CA_X,CA_Y,CA_BEST_REF_SCORE,CA_BEST_REF_COV,CA_BEST_REF_MATCH,CA_UCBShift,CB_X,CB_Y,CB_BEST_REF_SCORE,CB_BEST_REF_COV,CB_BEST_REF_MATCH,CB_UCBShift,N_X,N_Y,N_BEST_REF_SCORE,N_BEST_REF_COV,N_BEST_REF_MATCH,N_UCBShift
1,SER,8.449778585803086,,0,0,0,8.449778585803086,4.346355397657898,,0,0,0,4.346355397657898,173.70753803081362,,0,0,0,173.70753803081362,58.06961240071595,,0,0,0,58.06961240071595,63.36885864322344,,0,0,0,63.36885864322344,117.67728538291709,,0,0,0,117.67728538291709
2,TYR,8.129675583971583,,0,0,0,8.129675583971583,4.605472734509934,,0,0,0,4.605472734509934,175.94306435381284,,0,0,0,175.94306435381284,58.80544469846819,,0,0,0,58.80544469846819,38.85681472163392,,0,0,0,38.85681472163392,121.9755738439616,,0,0,0,121.9755738439616
3,GLY,8.289076884709734,,0,0,0,8.289076884709734,3.9659203715506712,,0,0,0,3.9659203715506712,174.19401850735377,,0,0,0,174.19401850735377,45.69555252839383,,0,0,0,45.69555252839383,,,0,0,0,,109.81649197340437,,0,0,0,109.81649197340437
4,ARG,8.07878019143634,,0,0,0,8.07878019143634,4.617869013489289,,0,0,0,4.617869013489289,174.45204942914307,,0,0,0,174.45204942914307,54.11060073023088,,0,0,0,54.11060073023088,30.243258894832945,,0,0,0,30.243258894832945,121.64043039862915,,0,0,0,121.64043039862915
5,PRO,,,0,0,0,,4.643895115576091,,0,0,0,4.643895115576091,171.16023095346875,,0,0,0,171.16023095346875,61.38440943812299,,0,0,0,61.38440943812299,30.998584036957485,,0,0,0,30.998584036957485,,,0,0,0,
6,PRO,,,0,0,0,,4.439079974264624,,0,0,0,4.439079974264624,171.61150715222556,,0,0,0,171.61150715222556,61.39907099131979,,0,0,0,61.39907099131979,30.70986429067044,,0,0,0,30.70986429067044,,,0,0,0,
7,PRO,,,0,0,0,,4.431243106937507,,0,0,0,4.431243106937507,176.75051493897215,,0,0,0,176.75051493897215,62.72146588325008,,0,0,0,62.72146588325008,31.722142166366968,,0,0,0,31.722142166366968,,,0,0,0,
8,ASP,8.416171298495948,,0,0,0,8.416171298495948,4.502109975513376,,0,0,0,4.502109975513376,176.34051566562883,,0,0,0,176.34051566562883,54.83487694700855,,0,0,0,54.83487694700855,40.736058905999556,,0,0,0,40.736058905999556,122.4237125415862,,0,0,0,122.4237125415862
9,VAL,7.9452956261738255,,0,0,0,7.9452956261738255,4.254420615501165,,0,0,0,4.254420615501165,176.4503344957598,,0,0,0,176.4503344957598,61.676225444716394,,0,0,0,61.676225444716394,32.294343853146856,,0,0,0,32.294343853146856,118.77695392701187,,0,0,0,118.77695392701187
10,GLU,8.243727180719281,,0,0,0,8.243727180719281,4.0359605559274065,,0,0,0,4.0359605559274065,177.03354277887667,,0,0,0,177.03354277887667,58.44408750579976,,0,0,0,58.44408750579976,29.296136716400266,,0,0,0,29.296136716400266,123.72986461492951,,0,0,0,123.72986461492951
11,GLY,8.745404666411366,,0,0,0,8.745404666411366,3.9612182849705846,,0,0,0,3.9612182849705846,174.44615737849372,,0,0,0,174.44615737849372,45.393810168181815,,0,0,0,45.393810168181815,,,0,0,0,,112.23830272685092,,0,0,0,112.23830272685092
12,MET,7.952130158064158,,0,0,0,7.952130158064158,4.5139482846986345,,0,0,0,4.5139482846986345,175.22730110896327,,0,0,0,175.22730110896327,55.782074384915084,,0,0,0,55.782074384915084,33.50703527525253,,0,0,0,33.50703527525253,119.68623207436451,,0,0,0,119.68623207436451
13,THR,8.719949906920856,,0,0,0,8.719949906920856,4.606950844322344,,0,0,0,4.606950844322344,173.82425380979575,,0,0,0,173.82425380979575,61.94203798707959,,0,0,0,61.94203798707959,69.85789626667777,,0,0,0,69.85789626667777,118.63453713161283,,0,0,0,118.63453713161283
14,SER,9.041404941625043,,0,0,0,9.041404941625043,5.154345399156399,,0,0,0,5.154345399156399,173.7150162093018,,0,0,0,173.7150162093018,57.34603072261627,,0,0,0,57.34603072261627,64.68681994387279,,0,0,0,64.68681994387279,122.95373986728272,,0,0,0,122.95373986728272
15,LEU,9.389761484293484,,0,0,0,9.389761484293484,5.147255951415252,,0,0,0,5.147255951415252,175.1777708145188,,0,0,0,175.1777708145188,52.9907928531191,,0,0,0,52.9907928531191,44.06154188578643,,0,0,0,44.06154188578643,125.93857129774115,,0,0,0,125.93857129774115
16,LYS,9.191568133094682,,0,0,0,9.191568133094682,4.639282249128649,,0,0,0,4.639282249128649,175.60767753433788,,0,0,0,175.60767753433788,55.52119095498946,,0,0,0,55.52119095498946,33.6506022455267,,0,0,0,33.6506022455267,123.40939343293928,,0,0,0,123.40939343293928
17,VAL,9.211386993395493,,0,0,0,9.211386993395493,4.975927725829726,,0,0,0,4.975927725829726,174.30108807753913,,0,0,0,174.30108807753913,60.65288181210456,,0,0,0,60.65288181210456,32.423670853485405,,0,0,0,32.423670853485405,128.43914984098677,,0,0,0,128.43914984098677
18,ASP,8.971191257203907,,0,0,0,8.971191257203907,5.42868283811744,,0,0,0,5.42868283811744,175.99940040963483,,0,0,0,175.99940040963483,52.483287914840716,,0,0,0,52.483287914840716,43.992375655622155,,0,0,0,43.992375655622155,127.6855179469475,,0,0,0,127.6855179469475
19,ASN,8.811158357115108,,0,0,0,8.811158357115108,4.3395047560106565,,0,0,0,4.3395047560106565,174.9606741855866,,0,0,0,174.9606741855866,54.1098271008769,,0,0,0,54.1098271008769,37.77799802253857,,0,0,0,37.77799802253857,117.97879617938729,,0,0,0,117.97879617938729
20,LEU,8.573514115001664,,0,0,0,8.573514115001664,4.278814791658342,,0,0,0,4.278814791658342,177.00738937646796,,0,0,0,177.00738937646796,55.12247967273282,,0,0,0,55.12247967273282,42.47518223936619,,0,0,0,42.47518223936619,116.4169992533855,,0,0,0,116.4169992533855
21,THR,7.920501186424687,,0,0,0,7.920501186424687,4.182395625757576,,0,0,0,4.182395625757576,175.76311453240092,,0,0,0,175.76311453240092,61.31962504250749,,0,0,0,61.31962504250749,70.11373286362526,,0,0,0,70.11373286362526,114.39045205382395,,0,0,0,114.39045205382395
22,TYR,8.292700544444443,,0,0,0,8.292700544444443,4.308355500591076,,0,0,0,4.308355500591076,176.48347292367632,,0,0,0,176.48347292367632,59.91778986415806,,0,0,0,59.91778986415806,37.88662690486735,,0,0,0,37.88662690486735,124.16619089426129,,0,0,0,124.16619089426129
23,ARG,7.409496597668998,,0,0,0,7.409496597668998,4.186074069136419,,0,0,0,4.186074069136419,176.46935856126098,,0,0,0,176.46935856126098,56.415049424597626,,0,0,0,56.415049424597626,30.307282663447662,,0,0,0,30.307282663447662,117.8278137094461,,0,0,0,117.8278137094461
24,THR,7.608125455816406,,0,0,0,7.608125455816406,4.036838783449883,,0,0,0,4.036838783449883,173.6567742718115,,0,0,0,173.6567742718115,65.21442192773893,,0,0,0,65.21442192773893,68.95937710872461,,0,0,0,68.95937710872461,118.85836487400933,,0,0,0,118.85836487400933
25,SER,8.681774125230325,,0,0,0,8.681774125230325,4.856919088833389,,0,0,0,4.856919088833389,173.7294626881674,,0,0,0,173.7294626881674,55.912701355966256,,0,0,0,55.912701355966256,63.5754149069375,,0,0,0,63.5754149069375,122.57461932799977,,0,0,0,122.57461932799977
26,PRO,,,0,0,0,,4.115078232708958,,0,0,0,4.115078232708958,178.13711832516373,,0,0,0,178.13711832516373,65.63340506427461,,0,0,0,65.63340506427461,31.9887303989344,,0,0,0,31.9887303989344,,,0,0,0,
27,ASP,8.61600591909202,,0,0,0,8.61600591909202,4.464066496231546,,0,0,0,4.464066496231546,178.61445913479855,,0,0,0,178.61445913479855,57.38723612603508,,0,0,0,57.38723612603508,39.98829073069708,,0,0,0,39.98829073069708,116.9119632061938,,0,0,0,116.9119632061938
28,THR,7.860077504484405,,0,0,0,7.860077504484405,3.9772420918969913,,0,0,0,3.9772420918969913,176.7847780187923,,0,0,0,176.7847780187923,65.97534763676325,,0,0,0,65.97534763676325,68.30729412444222,,0,0,0,68.30729412444222,118.08565170708181,,0,0,0,118.08565170708181
29,LEU,8.142561236818738,,0,0,0,8.142561236818738,4.237720976295926,,0,0,0,4.237720976295926,179.19870403792874,,0,0,0,179.19870403792874,57.792833444583195,,0,0,0,57.792833444583195,41.92801216571206,,0,0,0,41.92801216571206,121.94100796222111,,0,0,0,121.94100796222111
30,ARG,8.581634597408147,,0,0,0,8.581634597408147,3.796659155455655,,0,0,0,3.796659155455655,178.3283166331058,,0,0,0,178.3283166331058,60.28358217171162,,0,0,0,60.28358217171162,30.144271166727716,,0,0,0,30.144271166727716,120.4847607631202,,0,0,0,120.4847607631202
31,ARG,8.084649217321568,,0,0,0,8.084649217321568,4.072366768720168,,0,0,0,4.072366768720168,178.9903983689755,,0,0,0,178.9903983689755,59.217751457137304,,0,0,0,59.217751457137304,30.12047443962149,,0,0,0,30.12047443962149,119.00222275813076,,0,0,0,119.00222275813076
32,VAL,7.898008645387945,,0,0,0,7.898008645387945,3.7932193596542345,,0,0,0,3.7932193596542345,178.26902608533135,,0,0,0,178.26902608533135,65.6972716046842,,0,0,0,65.6972716046842,32.04344807231102,,0,0,0,32.04344807231102,120.02267833288379,,0,0,0,120.02267833288379
33,PHE,8.708639474281275,,0,0,0,8.708639474281275,4.444853381615606,,0,0,0,4.444853381615606,177.41400936926408,,0,0,0,177.41400936926408,60.261710610983464,,0,0,0,60.261710610983464,39.38759443699634,,0,0,0,39.38759443699634,116.62927833645243,,0,0,0,116.62927833645243
34,GLU,8.598114307375956,,0,0,0,8.598114307375956,4.648293040040515,,0,0,0,4.648293040040515,177.36814754278498,,0,0,0,177.36814754278498,58.29828475880231,,0,0,0,58.29828475880231,29.429831505044955,,0,0,0,29.429831505044955,119.26016739323454,,0,0,0,119.26016739323454
35,LYS,7.696117991369741,,0,0,0,7.696117991369741,4.007845070523921,,0,0,0,4.007845070523921,177.0999091377012,,0,0,0,177.0999091377012,58.165184589460544,,0,0,0,58.165184589460544,32.077471497302696,,0,0,0,32.077471497302696,118.57504786605617,,0,0,0,118.57504786605617
36,TYR,7.954304874664224,,0,0,0,7.954304874664224,4.62748864987235,,0,0,0,4.62748864987235,175.50301219671996,,0,0,0,175.50301219671996,58.59795944035409,,0,0,0,58.59795944035409,39.3614218549284,,0,0,0,39.3614218549284,115.73665800480074,,0,0,0,115.73665800480074
37,GLY,7.677443921900322,,0,0,0,7.677443921900322,4.293802062473638,,0,0,0,4.293802062473638,172.26716110180377,,0,0,0,172.26716110180377,45.338348413963814,,0,0,0,45.338348413963814,,,0,0,0,,106.34578582764458,,0,0,0,106.34578582764458
38,ARG,8.342287696808746,,0,0,0,8.342287696808746,4.537958242834943,,0,0,0,4.537958242834943,175.3796274327728,,0,0,0,175.3796274327728,55.78249216178266,,0,0,0,55.78249216178266,30.769492382445332,,0,0,0,30.769492382445332,119.27435283306693,,0,0,0,119.27435283306693
39,VAL,8.23456544044289,,0,0,0,8.23456544044289,3.95317230032745,,0,0,0,3.95317230032745,176.41816414784105,,0,0,0,176.41816414784105,62.73129078792319,,0,0,0,62.73129078792319,31.908177975363525,,0,0,0,31.908177975363525,126.02041381026751,,0,0,0,126.02041381026751
40,GLY,8.985801696187146,,0,0,0,8.985801696187146,3.9571572947774456,,0,0,0,3.9571572947774456,173.90228772566323,,0,0,0,173.90228772566323,45.647615993467646,,0,0,0,45.647615993467646,,,0,0,0,,116.82387129818514,,0,0,0,116.82387129818514
41,ASP,7.617507878798979,,0,0,0,7.617507878798979,4.847104952214452,,0,0,0,4.847104952214452,173.82409794835166,,0,0,0,173.82409794835166,53.99641200793651,,0,0,0,53.99641200793651,44.23994641681652,,0,0,0,44.23994641681652,118.28075431610613,,0,0,0,118.28075431610613
42,VAL,8.526487002908203,,0,0,0,8.526487002908203,5.002219003946054,,0,0,0,5.002219003946054,174.3388474461705,,0,0,0,174.3388474461705,61.274307352358754,,0,0,0,61.274307352358754,34.643923217254965,,0,0,0,34.643923217254965,123.24010628791208,,0,0,0,123.24010628791208
43,TYR,9.26631326981352,,0,0,0,9.26631326981352,5.056618938727939,,0,0,0,5.056618938727939,174.37596632909313,,0,0,0,174.37596632909313,56.450564287934284,,0,0,0,56.450564287934284,41.26878272074592,,0,0,0,41.26878272074592,128.85262033658563,,0,0,0,128.85262033658563
44,ILE,8.684130499800201,,0,0,0,8.684130499800201,4.299431684498835,,0,0,0,4.299431684498835,174.14507530689866,,0,0,0,174.14507530689866,57.44465184255189,,0,0,0,57.44465184255189,38.83935572829948,,0,0,0,38.83935572829948,128.01119317993118,,0,0,0,128.01119317993118
45,PRO,,,0,0,0,,4.023084941480742,,0,0,0,4.023084941480742,175.00925740722056,,0,0,0,175.00925740722056,62.64339834733045,,0,0,0,62.64339834733045,31.76765162665113,,0,0,0,31.76765162665113,,,0,0,0,
46,ARG,8.184354898040848,,0,0,0,8.184354898040848,4.634546848840048,,0,0,0,4.634546848840048,176.2457483202409,,0,0,0,176.2457483202409,54.876567397879896,,0,0,0,54.876567397879896,32.17605976922522,,0,0,0,32.17605976922522,123.0841078991231,,0,0,0,123.0841078991231
47,ASP,8.748436086063936,,0,0,0,8.748436086063936,4.652753960936286,,0,0,0,4.652753960936286,177.1663837433067,,0,0,0,177.1663837433067,54.31501139336775,,0,0,0,54.31501139336775,43.30744128910534,,0,0,0,43.30744128910534,123.78270917935953,,0,0,0,123.78270917935953
48,ARG,8.735213684093685,,0,0,0,8.735213684093685,4.026225192929293,,0,0,0,4.026225192929293,176.77527735349096,,0,0,0,176.77527735349096,57.802638908585855,,0,0,0,57.802638908585855,30.187819346891995,,0,0,0,30.187819346891995,124.129502154107,,0,0,0,124.129502154107
49,TYR,8.236075847341546,,0,0,0,8.236075847341546,4.484277014180265,,0,0,0,4.484277014180265,176.96313666319236,,0,0,0,176.96313666319236,59.91569303247308,,0,0,0,59.91569303247308,38.33915056940282,,0,0,0,38.33915056940282,118.2911144018648,,0,0,0,118.2911144018648
50,THR,8.01419613986014,,0,0,0,8.01419613986014,4.418073654037629,,0,0,0,4.418073654037629,175.67125122608502,,0,0,0,175.67125122608502,61.90196273725164,,0,0,0,61.90196273725164,70.17223086163835,,0,0,0,70.17223086163835,108.06870013615273,,0,0,0,108.06870013615273
51,LYS,7.9396335824841815,,0,0,0,7.9396335824841815,3.983349274408924,,0,0,0,3.983349274408924,175.64559069595404,,0,0,0,175.64559069595404,57.76044988845044,,0,0,0,57.76044988845044,29.00805689952825,,0,0,0,29.00805689952825,115.70420046305361,,0,0,0,115.70420046305361
52,GLU,8.070164321361972,,0,0,0,8.070164321361972,4.343263721478521,,0,0,0,4.343263721478521,176.9195104103563,,0,0,0,176.9195104103563,56.65177180919636,,0,0,0,56.65177180919636,30.337309223626374,,0,0,0,30.337309223626374,119.8400799390665,,0,0,0,119.8400799390665
53,SER,8.826005085930737,,0,0,0,8.826005085930737,4.277438706243756,,0,0,0,4.277438706243756,175.22694097864357,,0,0,0,175.22694097864357,59.190040936630034,,0,0,0,59.190040936630034,63.712003344766345,,0,0,0,63.712003344766345,119.7675722943057,,0,0,0,119.7675722943057
54,ARG,8.112253881635032,,0,0,0,8.112253881635032,4.263028807767233,,0,0,0,4.263028807767233,177.0269745259463,,0,0,0,177.0269745259463,56.61558545758686,,0,0,0,56.61558545758686,30.274837988439337,,0,0,0,30.274837988439337,123.51393038555334,,0,0,0,123.51393038555334
55,GLY,8.429756625946276,,0,0,0,8.429756625946276,3.987892457364857,,0,0,0,3.987892457364857,173.1447656700688,,0,0,0,173.1447656700688,45.816822199650346,,0,0,0,45.816822199650346,,,0,0,0,,107.79964885235876,,0,0,0,107.79964885235876
56,PHE,7.2958091800421805,,0,0,0,7.2958091800421805,5.451692865284715,,0,0,0,5.451692865284715,174.09098695814743,,0,0,0,174.09098695814743,55.510153081979134,,0,0,0,55.510153081979134,41.933083221134424,,0,0,0,41.933083221134424,114.16073924169163,,0,0,0,114.16073924169163
57,ALA,8.857982133577535,,0,0,0,8.857982133577535,4.809550873071374,,0,0,0,4.809550873071374,174.73057574845154,,0,0,0,174.73057574845154,50.72789503786213,,0,0,0,50.72789503786213,22.82254683147963,,0,0,0,22.82254683147963,120.969195705217,,0,0,0,120.969195705217
58,PHE,9.274007458630258,,0,0,0,9.274007458630258,5.545960476617827,,0,0,0,5.545960476617827,174.96658290582752,,0,0,0,174.96658290582752,56.45278201766567,,0,0,0,56.45278201766567,42.365772521717176,,0,0,0,42.365772521717176,119.16383621499057,,0,0,0,119.16383621499057
59,VAL,9.180833812642913,,0,0,0,9.180833812642913,4.5286137337662336,,0,0,0,4.5286137337662336,174.5918464078366,,0,0,0,174.5918464078366,61.202110641824845,,0,0,0,61.202110641824845,34.376403422827174,,0,0,0,34.376403422827174,123.36825032215008,,0,0,0,123.36825032215008
60,ARG,8.888068233322233,,0,0,0,8.888068233322233,5.325892158369408,,0,0,0,5.325892158369408,175.48735120425133,,0,0,0,175.48735120425133,54.75486693167388,,0,0,0,54.75486693167388,33.20080631878677,,0,0,0,33.20080631878677,126.16751708312243,,0,0,0,126.16751708312243
61,PHE,9.527623332395383,,0,0,0,9.527623332395383,5.258186293756243,,0,0,0,5.258186293756243,176.18232621962483,,0,0,0,176.18232621962483,57.180291405938505,,0,0,0,57.180291405938505,42.23820506330892,,0,0,0,42.23820506330892,123.00024941935287,,0,0,0,123.00024941935287
62,HIS,8.914332263553113,,0,0,0,8.914332263553113,4.234965322005772,,0,0,0,4.234965322005772,174.78775427836607,,0,0,0,174.78775427836607,58.411502798368296,,0,0,0,58.411502798368296,29.458381133244533,,0,0,0,29.458381133244533,119.76590493408814,,0,0,0,119.76590493408814
63,ASP,8.062508608319458,,0,0,0,8.062508608319458,4.887116399023199,,0,0,0,4.887116399023199,176.34390932066268,,0,0,0,176.34390932066268,53.11677910352425,,0,0,0,53.11677910352425,42.90268605213121,,0,0,0,42.90268605213121,118.14127316607838,,0,0,0,118.14127316607838
64,LYS,8.763689706049504,,0,0,0,8.763689706049504,4.160629958691309,,0,0,0,4.160629958691309,177.9414493929071,,0,0,0,177.9414493929071,59.65322044993896,,0,0,0,59.65322044993896,32.53615358717949,,0,0,0,32.53615358717949,124.82080677311578,,0,0,0,124.82080677311578
65,ARG,8.170078702630702,,0,0,0,8.170078702630702,4.003503737290487,,0,0,0,4.003503737290487,178.45321547494174,,0,0,0,178.45321547494174,59.23123072847153,,0,0,0,59.23123072847153,30.083734136813188,,0,0,0,30.083734136813188,118.44297202740593,,0,0,0,118.44297202740593
66,ASP,8.198977223604173,,0,0,0,8.198977223604173,4.394159321472972,,0,0,0,4.394159321472972,178.1111617475802,,0,0,0,178.1111617475802,56.701600362520814,,0,0,0,56.701600362520814,40.169214866061715,,0,0,0,40.169214866061715,120.06727117222778,,0,0,0,120.06727117222778
67,ALA,7.923995846142746,,0,0,0,7.923995846142746,3.093900063780664,,0,0,0,3.093900063780664,178.87709606033968,,0,0,0,178.87709606033968,55.12048729114774,,0,0,0,55.12048729114774,18.21940225994561,,0,0,0,18.21940225994561,123.12906622819958,,0,0,0,123.12906622819958
68,GLU,8.362643233261183,,0,0,0,8.362643233261183,3.8143527977994216,,0,0,0,3.8143527977994216,178.60947353723498,,0,0,0,178.60947353723498,59.40231627277167,,0,0,0,59.40231627277167,29.18400149911755,,0,0,0,29.18400149911755,118.44376733394938,,0,0,0,118.44376733394938
69,ASP,8.254305354367855,,0,0,0,8.254305354367855,4.380041683522033,,0,0,0,4.380041683522033,178.3302078716173,,0,0,0,178.3302078716173,57.0190519511655,,0,0,0,57.0190519511655,41.08703455776446,,0,0,0,41.08703455776446,120.29792237566878,,0,0,0,120.29792237566878
70,ALA,8.123686978388278,,0,0,0,8.123686978388278,3.048278154079254,,0,0,0,3.048278154079254,179.07784122784994,,0,0,0,179.07784122784994,54.90214937905428,,0,0,0,54.90214937905428,18.038838412753915,,0,0,0,18.038838412753915,122.54945239182484,,0,0,0,122.54945239182484
71,MET,8.257557558746807,,0,0,0,8.257557558746807,3.9477854867576867,,0,0,0,3.9477854867576867,177.4359151949384,,0,0,0,177.4359151949384,59.47468466625597,,0,0,0,59.47468466625597,32.793165383782885,,0,0,0,32.793165383782885,119.501115602997,,0,0,0,119.501115602997
72,ASP,8.198247928277278,,0,0,0,8.198247928277278,4.368833114768565,,0,0,0,4.368833114768565,178.23598346121102,,0,0,0,178.23598346121102,57.031966252614055,,0,0,0,57.031966252614055,40.81409730937951,,0,0,0,40.81409730937951,118.70499582798868,,0,0,0,118.70499582798868
73,ALA,7.934610763997115,,0,0,0,7.934610763997115,4.206096095121546,,0,0,0,4.206096095121546,179.0373665496115,,0,0,0,179.0373665496115,54.184898224364524,,0,0,0,54.184898224364524,18.65682862523033,,0,0,0,18.65682862523033,120.89543938401043,,0,0,0,120.89543938401043
74,MET,7.758173170041069,,0,0,0,7.758173170041069,4.2689233719280715,,0,0,0,4.2689233719280715,176.395028145671,,0,0,0,176.395028145671,55.89469421592852,,0,0,0,55.89469421592852,33.322001259007656,,0,0,0,33.322001259007656,114.17134239500498,,0,0,0,114.17134239500498
75,ASP,8.018597584620935,,0,0,0,8.018597584620935,4.416563917607393,,0,0,0,4.416563917607393,177.40277805240316,,0,0,0,177.40277805240316,57.25509721511267,,0,0,0,57.25509721511267,41.231118371633926,,0,0,0,41.231118371633926,119.68753001611167,,0,0,0,119.68753001611167
76,GLY,8.958849187851039,,0,0,0,8.958849187851039,3.907023859376735,,0,0,0,3.907023859376735,174.11567481210457,,0,0,0,174.11567481210457,45.458583953468754,,0,0,0,45.458583953468754,,,0,0,0,,117.80944663640804,,0,0,0,117.80944663640804
77,ALA,7.83701882062382,,0,0,0,7.83701882062382,4.260879656418582,,0,0,0,4.260879656418582,176.866300449334,,0,0,0,176.866300449334,52.3926348973138,,0,0,0,52.3926348973138,19.666014904412258,,0,0,0,19.666014904412258,124.03288082385392,,0,0,0,124.03288082385392
78,VAL,8.38576474136419,,0,0,0,8.38576474136419,4.468017975563325,,0,0,0,4.468017975563325,175.6948649589799,,0,0,0,175.6948649589799,61.893395480291936,,0,0,0,61.893395480291936,32.34807582464757,,0,0,0,32.34807582464757,121.94516646420801,,0,0,0,121.94516646420801
79,LEU,9.010250191253192,,0,0,0,9.010250191253192,4.713358723426573,,0,0,0,4.713358723426573,176.73743100061048,,0,0,0,176.73743100061048,54.142008165945164,,0,0,0,54.142008165945164,44.96281472869908,,0,0,0,44.96281472869908,129.1816569599678,,0,0,0,129.1816569599678
80,ASP,9.350410711294263,,0,0,0,9.350410711294263,4.242831581138306,,0,0,0,4.242831581138306,175.8290843531746,,0,0,0,175.8290843531746,55.230655884582085,,0,0,0,55.230655884582085,40.48691811443557,,0,0,0,40.48691811443557,128.1342427932623,,0,0,0,128.1342427932623
81,GLY,8.595445648290598,,0,0,0,8.595445648290598,3.836924368548119,,0,0,0,3.836924368548119,173.82958055501166,,0,0,0,173.82958055501166,45.3159689462371,,0,0,0,45.3159689462371,,,0,0,0,,103.52886462282717,,0,0,0,103.52886462282717
82,ARG,7.818933184443335,,0,0,0,7.818933184443335,4.682035573998224,,0,0,0,4.682035573998224,174.97140340732048,,0,0,0,174.97140340732048,54.36953464845155,,0,0,0,54.36953464845155,32.35728367881563,,0,0,0,32.35728367881563,121.21451930499501,,0,0,0,121.21451930499501
83,GLU,8.732498777772228,,0,0,0,8.732498777772228,4.466550584035409,,0,0,0,4.466550584035409,177.0734750780719,,0,0,0,177.0734750780719,56.57978937364857,,0,0,0,56.57978937364857,30.17084295112665,,0,0,0,30.17084295112665,123.11313602341548,,0,0,0,123.11313602341548
84,LEU,8.934957031163282,,0,0,0,8.934957031163282,4.433197005366856,,0,0,0,4.433197005366856,176.14051413236209,,0,0,0,176.14051413236209,55.496116224392274,,0,0,0,55.496116224392274,43.19817211929182,,0,0,0,43.19817211929182,126.81264147884893,,0,0,0,126.81264147884893
85,ARG,8.626647435586635,,0,0,0,8.626647435586635,4.7697838574259075,,0,0,0,4.7697838574259075,175.3985326068265,,0,0,0,175.3985326068265,55.391461617821065,,0,0,0,55.391461617821065,31.578945273565324,,0,0,0,31.578945273565324,122.22000683111888,,0,0,0,122.22000683111888
86,VAL,9.107579804551005,,0,0,0,9.107579804551005,4.9955328735542235,,0,0,0,4.9955328735542235,174.92236230336886,,0,0,0,174.92236230336886,61.019913924414475,,0,0,0,61.019913924414475,33.79389895540015,,0,0,0,33.79389895540015,125.47208651847042,,0,0,0,125.47208651847042
87,GLN,9.036558575330226,,0,0,0,9.036558575330226,4.598518986596737,,0,0,0,4.598518986596737,174.95833017753358,,0,0,0,174.95833017753358,53.97662895954046,,0,0,0,53.97662895954046,33.0936732006216,,0,0,0,33.0936732006216,124.8347588423854,,0,0,0,124.8347588423854
88,MET,8.85568438081363,,0,0,0,8.85568438081363,4.600307022560773,,0,0,0,4.600307022560773,176.22551695891886,,0,0,0,176.22551695891886,56.98101047509157,,0,0,0,56.98101047509157,32.4854365062826,,0,0,0,32.4854365062826,121.84302849176933,,0,0,0,121.84302849176933
89,ALA,8.672307868270618,,0,0,0,8.672307868270618,4.357717453604729,,0,0,0,4.357717453604729,177.87942699880122,,0,0,0,177.87942699880122,52.04856921405816,,0,0,0,52.04856921405816,19.09440755910201,,0,0,0,19.09440755910201,129.05697473328894,,0,0,0,129.05697473328894