RESNUM,RESNAME,H_X,H_Y,H_BEST_REF_SCORE,H_BEST_REF_COV,H_BEST_REF_MATCH,H_UCBShift,HA_X,HA_Y,HA_BEST_REF_SCORE,HA_BEST_REF_COV,HA_BEST_REF_MATCH,HA_UCBShift,C_X,C_Y,C_BEST_REF_SCORE,C_BEST_REF_COV,C_BEST_REF_MATCH,C_UCBShift,CA_X,CA_Y,CA_BEST_REF_SCORE,CA_BEST_REF_COV,CA_BEST_REF_MATCH,CA_UCBShift,CB_X,CB_Y,CB_BEST_REF_SCORE,CB_BEST_REF_COV,CB_BEST_REF_MATCH,CB_UCBShift,N_X,N_Y,N_BEST_REF_SCORE,N_BEST_REF_COV,N_BEST_REF_MATCH,N_UCBShift
1,MET,8.388824985986234,,0,0,0,8.388824985986234,4.3385925425074925,,0,0,0,4.3385925425074925,174.40892997258854,,0,0,0,174.40892997258854,55.103594065118216,,0,0,0,55.103594065118216,33.06778310887446,,0,0,0,33.06778310887446,121.21208774075923,,0,0,0,121.21208774075923
2,VAL,8.248724478471528,,0,0,0,8.248724478471528,4.141612301642802,,0,0,0,4.141612301642802,175.56077677190032,,0,0,0,175.56077677190032,62.068753455178154,,0,0,0,62.068753455178154,32.867329116378066,,0,0,0,32.867329116378066,122.88416354656455,,0,0,0,122.88416354656455
3,GLU,8.492745708080808,,0,0,0,8.492745708080808,4.190765043972693,,0,0,0,4.190765043972693,176.40878447639582,,0,0,0,176.40878447639582,56.38945335760351,,0,0,0,56.38945335760351,29.680434324808523,,0,0,0,29.680434324808523,125.57961686595073,,0,0,0,125.57961686595073
4,ALA,8.32241041941947,,0,0,0,8.32241041941947,4.279835819266845,,0,0,0,4.279835819266845,177.32540092534134,,0,0,0,177.32540092534134,52.17899468194583,,0,0,0,52.17899468194583,18.267190211865913,,0,0,0,18.267190211865913,127.77348966610056,,0,0,0,127.77348966610056
5,ASP,8.41405645980131,,0,0,0,8.41405645980131,4.472646275513376,,0,0,0,4.472646275513376,176.26060106336442,,0,0,0,176.26060106336442,55.40195132646243,,0,0,0,55.40195132646243,40.997192422716175,,0,0,0,40.997192422716175,122.04092581466867,,0,0,0,122.04092581466867
6,ARG,7.765219947136196,,0,0,0,7.765219947136196,4.812641688139639,,0,0,0,4.812641688139639,173.6960264990454,,0,0,0,173.6960264990454,53.27827459748585,,0,0,0,53.27827459748585,30.784191648418247,,0,0,0,30.784191648418247,117.3005025128094,,0,0,0,117.3005025128094
7,PRO,,,0,0,0,,4.407666434537684,,0,0,0,4.407666434537684,176.30092930344657,,0,0,0,176.30092930344657,64.15926168597514,,0,0,0,64.15926168597514,31.93669666578422,,0,0,0,31.93669666578422,,,0,0,0,
8,GLY,8.47637389931735,,0,0,0,8.47637389931735,3.9464166897574646,,0,0,0,3.9464166897574646,173.21687825801976,,0,0,0,173.21687825801976,45.61964236676657,,0,0,0,45.61964236676657,,,0,0,0,,106.86770622084582,,0,0,0,106.86770622084582
9,LYS,7.890766858519257,,0,0,0,7.890766858519257,5.060320725635476,,0,0,0,5.060320725635476,176.3541126445721,,0,0,0,176.3541126445721,55.52517670645466,,0,0,0,55.52517670645466,34.823346845443446,,0,0,0,34.823346845443446,121.09064208897769,,0,0,0,121.09064208897769
10,LEU,9.431307932728384,,0,0,0,9.431307932728384,5.290765686441336,,0,0,0,5.290765686441336,175.35464440108225,,0,0,0,175.35464440108225,53.24367303881119,,0,0,0,53.24367303881119,45.27034557146187,,0,0,0,45.27034557146187,125.68927124809635,,0,0,0,125.68927124809635
11,PHE,9.434700835142635,,0,0,0,9.434700835142635,4.667237465667665,,0,0,0,4.667237465667665,173.8207044394439,,0,0,0,173.8207044394439,56.889897552702855,,0,0,0,56.889897552702855,41.54866682832723,,0,0,0,41.54866682832723,123.03654696729936,,0,0,0,123.03654696729936
12,ILE,8.662313785409035,,0,0,0,8.662313785409035,4.73513935033855,,0,0,0,4.73513935033855,174.4408833604229,,0,0,0,174.4408833604229,59.33841844736375,,0,0,0,59.33841844736375,39.08653563209568,,0,0,0,39.08653563209568,126.84294929017095,,0,0,0,126.84294929017095
13,GLY,8.959708271012321,,0,0,0,8.959708271012321,4.250165969427795,,0,0,0,4.250165969427795,174.2032771561272,,0,0,0,174.2032771561272,43.86483397038517,,0,0,0,43.86483397038517,,,0,0,0,,114.71418589816295,,0,0,0,114.71418589816295
14,GLY,8.301210895537796,,0,0,0,8.301210895537796,4.041921131887557,,0,0,0,4.041921131887557,174.73149871601177,,0,0,0,174.73149871601177,46.36597350455101,,0,0,0,46.36597350455101,,,0,0,0,,107.49716644021534,,0,0,0,107.49716644021534
15,LEU,8.116890555572205,,0,0,0,8.116890555572205,4.176492418117993,,0,0,0,4.176492418117993,176.34430749108114,,0,0,0,176.34430749108114,54.92578386691642,,0,0,0,54.92578386691642,42.1687888478466,,0,0,0,42.1687888478466,119.77880032833832,,0,0,0,119.77880032833832
16,ASN,8.556966203318904,,0,0,0,8.556966203318904,4.7203735086802086,,0,0,0,4.7203735086802086,177.0580380462371,,0,0,0,177.0580380462371,52.428652226279276,,0,0,0,52.428652226279276,39.38104528946054,,0,0,0,39.38104528946054,120.3667438051504,,0,0,0,120.3667438051504
17,THR,8.617974710900212,,0,0,0,8.617974710900212,4.023793323615274,,0,0,0,4.023793323615274,175.42379457949272,,0,0,0,175.42379457949272,64.40167225420136,,0,0,0,64.40167225420136,68.6064704605006,,0,0,0,68.6064704605006,113.98664504598179,,0,0,0,113.98664504598179
18,GLU,8.445082606693306,,0,0,0,8.445082606693306,4.27857170497558,,0,0,0,4.27857170497558,176.66372782439782,,0,0,0,176.66372782439782,56.430259110328564,,0,0,0,56.430259110328564,29.435879670929072,,0,0,0,29.435879670929072,118.51872811361972,,0,0,0,118.51872811361972
19,THR,7.608727542141192,,0,0,0,7.608727542141192,4.19154895000555,,0,0,0,4.19154895000555,173.1748248482906,,0,0,0,173.1748248482906,65.47122318600289,,0,0,0,65.47122318600289,68.85284026995782,,0,0,0,68.85284026995782,118.13708748931069,,0,0,0,118.13708748931069
20,ASN,8.30269304950605,,0,0,0,8.30269304950605,4.8475044431568435,,0,0,0,4.8475044431568435,175.50562229863468,,0,0,0,175.50562229863468,52.18300218956044,,0,0,0,52.18300218956044,40.52440888720724,,0,0,0,40.52440888720724,124.7950208065379,,0,0,0,124.7950208065379
21,GLU,9.033443651909202,,0,0,0,9.033443651909202,3.801479366663891,,0,0,0,3.801479366663891,177.65709149037073,,0,0,0,177.65709149037073,61.05930318793429,,0,0,0,61.05930318793429,29.379416448279496,,0,0,0,29.379416448279496,120.7705338034188,,0,0,0,120.7705338034188
22,LYS,8.501578243567543,,0,0,0,8.501578243567543,4.120903900604951,,0,0,0,4.120903900604951,178.97638604658118,,0,0,0,178.97638604658118,59.46805635833056,,0,0,0,59.46805635833056,32.02790823515374,,0,0,0,32.02790823515374,118.63967768509269,,0,0,0,118.63967768509269
23,ALA,7.794087904767455,,0,0,0,7.794087904767455,4.166463328177378,,0,0,0,4.166463328177378,180.1974369188312,,0,0,0,180.1974369188312,54.735217150127646,,0,0,0,54.735217150127646,18.41782721930847,,0,0,0,18.41782721930847,122.8514551945721,,0,0,0,122.8514551945721
24,LEU,8.22041622889333,,0,0,0,8.22041622889333,4.1815190991175495,,0,0,0,4.1815190991175495,179.19978417299367,,0,0,0,179.19978417299367,57.85773847576868,,0,0,0,57.85773847576868,41.77308334332889,,0,0,0,41.77308334332889,119.58410422217227,,0,0,0,119.58410422217227
25,GLU,8.855832051687202,,0,0,0,8.855832051687202,3.865569868997669,,0,0,0,3.865569868997669,178.65525332782772,,0,0,0,178.65525332782772,60.19355543116883,,0,0,0,60.19355543116883,29.659047894488843,,0,0,0,29.659047894488843,120.41491057479188,,0,0,0,120.41491057479188
26,ALA,7.911984808219558,,0,0,0,7.911984808219558,4.142530872294373,,0,0,0,4.142530872294373,179.9165236567044,,0,0,0,179.9165236567044,54.66284948875569,,0,0,0,54.66284948875569,18.129045941536244,,0,0,0,18.129045941536244,120.99792857328227,,0,0,0,120.99792857328227
27,VAL,7.893252969696969,,0,0,0,7.893252969696969,3.6419431093767347,,0,0,0,3.6419431093767347,177.4963164956155,,0,0,0,177.4963164956155,65.3698434506216,,0,0,0,65.3698434506216,31.841851044128095,,0,0,0,31.841851044128095,117.80169468372739,,0,0,0,117.80169468372739
28,PHE,9.13282523866134,,0,0,0,9.13282523866134,4.524984093745143,,0,0,0,4.524984093745143,177.4876383970141,,0,0,0,177.4876383970141,60.213502359179714,,0,0,0,60.213502359179714,39.502392364374515,,0,0,0,39.502392364374515,116.27943067409257,,0,0,0,116.27943067409257
29,GLY,8.56499102935398,,0,0,0,8.56499102935398,3.9499989799700304,,0,0,0,3.9499989799700304,175.13213001692753,,0,0,0,175.13213001692753,46.36467808896659,,0,0,0,46.36467808896659,,,0,0,0,,107.50474697207792,,0,0,0,107.50474697207792
30,LYS,7.790470039932289,,0,0,0,7.790470039932289,4.058421820912421,,0,0,0,4.058421820912421,177.2216057483239,,0,0,0,177.2216057483239,57.98146283831169,,0,0,0,57.98146283831169,31.886667790287493,,0,0,0,31.886667790287493,119.04546941889778,,0,0,0,119.04546941889778
31,TYR,7.894577369957819,,0,0,0,7.894577369957819,4.506009341905317,,0,0,0,4.506009341905317,176.04658764981684,,0,0,0,176.04658764981684,58.63758195946831,,0,0,0,58.63758195946831,39.32601346222666,,0,0,0,39.32601346222666,116.13148068654122,,0,0,0,116.13148068654122
32,GLY,7.6849588365079375,,0,0,0,7.6849588365079375,4.310771113275614,,0,0,0,4.310771113275614,172.37157076677767,,0,0,0,172.37157076677767,45.293823464457766,,0,0,0,45.293823464457766,,,0,0,0,,105.31233006267065,,0,0,0,105.31233006267065
33,ARG,8.503916230991232,,0,0,0,8.503916230991232,4.483146943767344,,0,0,0,4.483146943767344,175.93184065917973,,0,0,0,175.93184065917973,56.1777553565268,,0,0,0,56.1777553565268,30.71309424168609,,0,0,0,30.71309424168609,119.38782095955156,,0,0,0,119.38782095955156
34,ILE,8.580017344638694,,0,0,0,8.580017344638694,3.9312125563214564,,0,0,0,3.9312125563214564,175.8237916852259,,0,0,0,175.8237916852259,61.678124784132535,,0,0,0,61.678124784132535,38.34845150412365,,0,0,0,38.34845150412365,125.31313158202909,,0,0,0,125.31313158202909
35,VAL,8.942543444427795,,0,0,0,8.942543444427795,3.9652643235236984,,0,0,0,3.9652643235236984,176.3642936233822,,0,0,0,176.3642936233822,63.45478034931735,,0,0,0,63.45478034931735,32.70663520752581,,0,0,0,32.70663520752581,128.3484036233156,,0,0,0,128.3484036233156
36,GLU,8.084989773637474,,0,0,0,8.084989773637474,4.468807846667222,,0,0,0,4.468807846667222,174.04979006651126,,0,0,0,174.04979006651126,55.77798449311799,,0,0,0,55.77798449311799,33.03799255054945,,0,0,0,33.03799255054945,117.27661136954713,,0,0,0,117.27661136954713
37,VAL,8.594727805677655,,0,0,0,8.594727805677655,4.6297776860916855,,0,0,0,4.6297776860916855,174.3614394537962,,0,0,0,174.3614394537962,61.39903931593407,,0,0,0,61.39903931593407,33.66209865325785,,0,0,0,33.66209865325785,124.30554037717283,,0,0,0,124.30554037717283
38,LEU,9.122441071201022,,0,0,0,9.122441071201022,4.726375621145522,,0,0,0,4.726375621145522,175.6729393673715,,0,0,0,175.6729393673715,53.54567070764236,,0,0,0,53.54567070764236,43.3581186534521,,0,0,0,43.3581186534521,128.16007654734153,,0,0,0,128.16007654734153
39,LEU,8.834829613542015,,0,0,0,8.834829613542015,4.408353993312244,,0,0,0,4.408353993312244,175.66693557783327,,0,0,0,175.66693557783327,54.55454781505161,,0,0,0,54.55454781505161,42.999581475152624,,0,0,0,42.999581475152624,126.15136120960706,,0,0,0,126.15136120960706
40,MET,8.821709811582862,,0,0,0,8.821709811582862,4.527878744988345,,0,0,0,4.527878744988345,174.6075344320069,,0,0,0,174.6075344320069,54.58609943477078,,0,0,0,54.58609943477078,31.795312505944054,,0,0,0,31.795312505944054,126.55819110320235,,0,0,0,126.55819110320235
41,LYS,8.524513893228992,,0,0,0,8.524513893228992,4.727503725330225,,0,0,0,4.727503725330225,176.10010419095903,,0,0,0,176.10010419095903,55.21206532335997,,0,0,0,55.21206532335997,34.672257774003775,,0,0,0,34.672257774003775,123.45667849979466,,0,0,0,123.45667849979466
42,ASP,8.74495662031857,,0,0,0,8.74495662031857,4.6084316801226555,,0,0,0,4.6084316801226555,177.09340655643246,,0,0,0,177.09340655643246,53.89846218876124,,0,0,0,53.89846218876124,43.33320675515041,,0,0,0,43.33320675515041,124.4106640556166,,0,0,0,124.4106640556166
43,ARG,8.704621704562104,,0,0,0,8.704621704562104,4.119876210875236,,0,0,0,4.119876210875236,177.14353335053838,,0,0,0,177.14353335053838,58.16505930753691,,0,0,0,58.16505930753691,30.131255114990562,,0,0,0,30.131255114990562,125.57052059063159,,0,0,0,125.57052059063159
44,GLU,8.375142773593074,,0,0,0,8.375142773593074,4.252934067094016,,0,0,0,4.252934067094016,178.03677498344987,,0,0,0,178.03677498344987,58.231020427383726,,0,0,0,58.231020427383726,30.03888129020424,,0,0,0,30.03888129020424,118.2586954035964,,0,0,0,118.2586954035964
45,THR,8.215690503546455,,0,0,0,8.215690503546455,4.387917887626262,,0,0,0,4.387917887626262,175.51690065246973,,0,0,0,175.51690065246973,61.437880426617824,,0,0,0,61.437880426617824,70.1760904486458,,0,0,0,70.1760904486458,108.35269607693971,,0,0,0,108.35269607693971
46,ASN,8.034340197191698,,0,0,0,8.034340197191698,4.456761252780553,,0,0,0,4.456761252780553,174.4455479681818,,0,0,0,174.4455479681818,54.54859618536464,,0,0,0,54.54859618536464,37.871739051531804,,0,0,0,37.871739051531804,117.56769333194583,,0,0,0,117.56769333194583
47,LYS,7.809765454118104,,0,0,0,7.809765454118104,4.394121139105339,,0,0,0,4.394121139105339,176.1563399271506,,0,0,0,176.1563399271506,56.06594530448996,,0,0,0,56.06594530448996,33.31140468833389,,0,0,0,33.31140468833389,119.59776919467755,,0,0,0,119.59776919467755
48,SER,8.593738462859363,,0,0,0,8.593738462859363,4.262909498040848,,0,0,0,4.262909498040848,174.37944387535242,,0,0,0,174.37944387535242,59.23784632337662,,0,0,0,59.23784632337662,63.790033180375175,,0,0,0,63.790033180375175,119.63185756081141,,0,0,0,119.63185756081141
49,ARG,8.918304884321234,,0,0,0,8.918304884321234,4.3237168504773,,0,0,0,4.3237168504773,176.37494678869464,,0,0,0,176.37494678869464,56.56300048340548,,0,0,0,56.56300048340548,30.767352924453323,,0,0,0,30.767352924453323,123.54602796248751,,0,0,0,123.54602796248751
50,GLY,8.202643933383284,,0,0,0,8.202643933383284,3.97675760049395,,0,0,0,3.97675760049395,173.22186242467532,,0,0,0,173.22186242467532,45.808178808835606,,0,0,0,45.808178808835606,,,0,0,0,,107.66623007778888,,0,0,0,107.66623007778888
51,PHE,7.401309543856145,,0,0,0,7.401309543856145,5.43564638086358,,0,0,0,5.43564638086358,173.06146773485403,,0,0,0,173.06146773485403,55.34564101713842,,0,0,0,55.34564101713842,42.20178758484848,,0,0,0,42.20178758484848,114.47952509088688,,0,0,0,114.47952509088688
52,ALA,8.81107132974803,,0,0,0,8.81107132974803,5.323489587823289,,0,0,0,5.323489587823289,175.12228769880122,,0,0,0,175.12228769880122,50.623552937456985,,0,0,0,50.623552937456985,22.944735032900436,,0,0,0,22.944735032900436,120.85270036224331,,0,0,0,120.85270036224331
53,PHE,9.241073522904873,,0,0,0,9.241073522904873,5.462800548595848,,0,0,0,5.462800548595848,174.88634429975025,,0,0,0,174.88634429975025,56.336327389860145,,0,0,0,56.336327389860145,42.73710407099568,,0,0,0,42.73710407099568,118.87079288287268,,0,0,0,118.87079288287268
54,VAL,9.155042254989455,,0,0,0,9.155042254989455,4.717971491869241,,0,0,0,4.717971491869241,174.4929269792985,,0,0,0,174.4929269792985,60.87869392970918,,0,0,0,60.87869392970918,35.15444374718614,,0,0,0,35.15444374718614,123.269688486569,,0,0,0,123.269688486569
55,THR,8.798641275269176,,0,0,0,8.798641275269176,5.068249654861805,,0,0,0,5.068249654861805,174.3080073567488,,0,0,0,174.3080073567488,61.91608789203019,,0,0,0,61.91608789203019,69.36763628288378,,0,0,0,69.36763628288378,124.5171605387224,,0,0,0,124.5171605387224
56,PHE,9.365416166694418,,0,0,0,9.365416166694418,4.93234739948385,,0,0,0,4.93234739948385,176.00317830614387,,0,0,0,176.00317830614387,58.73742173198468,,0,0,0,58.73742173198468,41.15680381444667,,0,0,0,41.15680381444667,125.96106862882672,,0,0,0,125.96106862882672
57,GLU,9.21946841051726,,0,0,0,9.21946841051726,4.1599992090798095,,0,0,0,4.1599992090798095,176.5556274304917,,0,0,0,176.5556274304917,58.692929004662005,,0,0,0,58.692929004662005,30.53008523992119,,0,0,0,30.53008523992119,121.75339385849706,,0,0,0,121.75339385849706
58,SER,8.023297286186036,,0,0,0,8.023297286186036,4.910103784293485,,0,0,0,4.910103784293485,173.80416124004884,,0,0,0,173.80416124004884,55.10603517846597,,0,0,0,55.10603517846597,64.77238762268287,,0,0,0,64.77238762268287,113.7444324516983,,0,0,0,113.7444324516983
59,PRO,,,0,0,0,,4.254496857603508,,0,0,0,4.254496857603508,178.51424783559776,,0,0,0,178.51424783559776,64.91480777034631,,0,0,0,64.91480777034631,32.077213272022426,,0,0,0,32.077213272022426,,,0,0,0,
60,ALA,8.184258212337662,,0,0,0,8.184258212337662,4.090122658361084,,0,0,0,4.090122658361084,180.0507305890221,,0,0,0,180.0507305890221,54.995610306648906,,0,0,0,54.995610306648906,18.11631981034521,,0,0,0,18.11631981034521,120.71773595535021,,0,0,0,120.71773595535021
61,ASP,7.933287631712732,,0,0,0,7.933287631712732,4.373986446292596,,0,0,0,4.373986446292596,178.23747751323677,,0,0,0,178.23747751323677,56.7633726474137,,0,0,0,56.7633726474137,40.32903965944611,,0,0,0,40.32903965944611,119.42594490599402,,0,0,0,119.42594490599402
62,ALA,8.130626303141304,,0,0,0,8.130626303141304,3.016439525888,,0,0,0,3.016439525888,178.7589336033078,,0,0,0,178.7589336033078,55.111539516339214,,0,0,0,55.111539516339214,18.330072882661785,,0,0,0,18.330072882661785,121.62532964901764,,0,0,0,121.62532964901764
63,LYS,8.01584836168276,,0,0,0,8.01584836168276,3.773573988053613,,0,0,0,3.773573988053613,178.80170908687424,,0,0,0,178.80170908687424,59.91120086070041,,0,0,0,59.91120086070041,32.0891976470363,,0,0,0,32.0891976470363,119.14060532029083,,0,0,0,119.14060532029083
64,ASP,8.24582352948718,,0,0,0,8.24582352948718,4.372015201998002,,0,0,0,4.372015201998002,178.2341050492563,,0,0,0,178.2341050492563,57.005046611749364,,0,0,0,57.005046611749364,40.34599013955489,,0,0,0,40.34599013955489,120.24125798718504,,0,0,0,120.24125798718504
65,ALA,8.107425013109113,,0,0,0,8.107425013109113,2.955449199675324,,0,0,0,2.955449199675324,179.09643614513266,,0,0,0,179.09643614513266,54.533776102985904,,0,0,0,54.533776102985904,17.61089912934288,,0,0,0,17.61089912934288,123.43878831512376,,0,0,0,123.43878831512376
66,ALA,8.759653474647575,,0,0,0,8.759653474647575,3.879080138159063,,0,0,0,3.879080138159063,178.96402775444002,,0,0,0,178.96402775444002,55.443274247136195,,0,0,0,55.443274247136195,18.04649912621823,,0,0,0,18.04649912621823,121.01429219375069,,0,0,0,121.01429219375069
67,ARG,7.88857621958042,,0,0,0,7.88857621958042,4.0439127677933175,,0,0,0,4.0439127677933175,177.98954611703854,,0,0,0,177.98954611703854,58.89293146327561,,0,0,0,58.89293146327561,30.134235678171827,,0,0,0,30.134235678171827,117.08483024668665,,0,0,0,117.08483024668665
68,ASP,7.991681975635476,,0,0,0,7.991681975635476,4.497018376451327,,0,0,0,4.497018376451327,178.31229270205907,,0,0,0,178.31229270205907,56.52236745522256,,0,0,0,56.52236745522256,41.63035433533689,,0,0,0,41.63035433533689,119.26730469740815,,0,0,0,119.26730469740815
69,MET,8.221152757592407,,0,0,0,8.221152757592407,4.350255329631479,,0,0,0,4.350255329631479,176.6703630207515,,0,0,0,176.6703630207515,55.977450565745364,,0,0,0,55.977450565745364,33.02440713823954,,0,0,0,33.02440713823954,114.9298137971806,,0,0,0,114.9298137971806
70,ASN,8.089836035175935,,0,0,0,8.089836035175935,4.4389112041347545,,0,0,0,4.4389112041347545,176.98760124360638,,0,0,0,176.98760124360638,56.14279063406593,,0,0,0,56.14279063406593,38.24566921696081,,0,0,0,38.24566921696081,117.52487848719059,,0,0,0,117.52487848719059
71,GLY,8.886434546281496,,0,0,0,8.886434546281496,3.984291645249195,,0,0,0,3.984291645249195,174.70514767415918,,0,0,0,174.70514767415918,45.6599024057609,,0,0,0,45.6599024057609,,,0,0,0,,116.72482015791986,,0,0,0,116.72482015791986
72,LYS,7.91869699105894,,0,0,0,7.91869699105894,4.336488182267733,,0,0,0,4.336488182267733,175.54679179428905,,0,0,0,175.54679179428905,56.338477025352425,,0,0,0,56.338477025352425,33.82781406220447,,0,0,0,33.82781406220447,121.43003736225441,,0,0,0,121.43003736225441
73,SER,8.491384915484517,,0,0,0,8.491384915484517,4.861451186297035,,0,0,0,4.861451186297035,173.94725843735708,,0,0,0,173.94725843735708,58.04714327110667,,0,0,0,58.04714327110667,63.84116582398157,,0,0,0,63.84116582398157,116.77800291167722,,0,0,0,116.77800291167722
74,LEU,9.032485133316683,,0,0,0,9.032485133316683,4.656231163364414,,0,0,0,4.656231163364414,176.65545008391607,,0,0,0,176.65545008391607,53.9452795474248,,0,0,0,53.9452795474248,44.89219350455655,,0,0,0,44.89219350455655,128.10591684332888,,0,0,0,128.10591684332888
75,ASP,9.376831055461205,,0,0,0,9.376831055461205,4.302795937190587,,0,0,0,4.302795937190587,176.1173932937507,,0,0,0,176.1173932937507,55.43527874888445,,0,0,0,55.43527874888445,40.42512339227439,,0,0,0,40.42512339227439,128.10801631501278,,0,0,0,128.10801631501278
76,GLY,8.591377122849373,,0,0,0,8.591377122849373,3.8691757161449662,,0,0,0,3.8691757161449662,174.0436518050727,,0,0,0,174.0436518050727,45.38200345947941,,0,0,0,45.38200345947941,,,0,0,0,,103.48174856063936,,0,0,0,103.48174856063936
77,LYS,7.76199565060495,,0,0,0,7.76199565060495,4.64466552032967,,0,0,0,4.64466552032967,175.3551881246864,,0,0,0,175.3551881246864,54.43569987636253,,0,0,0,54.43569987636253,34.705606783999336,,0,0,0,34.705606783999336,121.28323426680542,,0,0,0,121.28323426680542
78,ALA,8.56869706943612,,0,0,0,8.56869706943612,4.5555952125818635,,0,0,0,4.5555952125818635,177.12467786408592,,0,0,0,177.12467786408592,52.50264733968254,,0,0,0,52.50264733968254,18.812069410711512,,0,0,0,18.812069410711512,127.01847327654012,,0,0,0,127.01847327654012
79,ILE,8.683541943956044,,0,0,0,8.683541943956044,4.8104432001665005,,0,0,0,4.8104432001665005,174.66360251452437,,0,0,0,174.66360251452437,60.01668387778333,,0,0,0,60.01668387778333,39.76133312256077,,0,0,0,39.76133312256077,120.41780195476746,,0,0,0,120.41780195476746
80,LYS,8.835769344183594,,0,0,0,8.835769344183594,4.721657142346542,,0,0,0,4.721657142346542,175.38578838148518,,0,0,0,175.38578838148518,55.185286183716286,,0,0,0,55.185286183716286,34.477697759984466,,0,0,0,34.477697759984466,124.70218871758797,,0,0,0,124.70218871758797
81,VAL,8.962641806371405,,0,0,0,8.962641806371405,4.939791045848596,,0,0,0,4.939791045848596,175.05191404226886,,0,0,0,175.05191404226886,60.94099508669109,,0,0,0,60.94099508669109,33.70394947221112,,0,0,0,33.70394947221112,126.37176356358087,,0,0,0,126.37176356358087
82,GLU,9.153632809262959,,0,0,0,9.153632809262959,4.788808573859473,,0,0,0,4.788808573859473,175.5022158106338,,0,0,0,175.5022158106338,54.17481247850483,,0,0,0,54.17481247850483,34.57164087867133,,0,0,0,34.57164087867133,125.74180929483295,,0,0,0,125.74180929483295
83,GLN,8.89346240759241,,0,0,0,8.89346240759241,4.464335998135198,,0,0,0,4.464335998135198,175.87027215256964,,0,0,0,175.87027215256964,56.99066490814186,,0,0,0,56.99066490814186,29.216517284276833,,0,0,0,29.216517284276833,121.48662519042624,,0,0,0,121.48662519042624
84,ALA,8.672097310789212,,0,0,0,8.672097310789212,4.322369713411589,,0,0,0,4.322369713411589,176.89867278450996,,0,0,0,176.89867278450996,52.22213836888667,,0,0,0,52.22213836888667,18.953555402081253,,0,0,0,18.953555402081253,128.9449769034521,,0,0,0,128.9449769034521
85,THR,8.245892707248307,,0,0,0,8.245892707248307,4.414273655422355,,0,0,0,4.414273655422355,174.47139184530468,,0,0,0,174.47139184530468,61.80651479464979,,0,0,0,61.80651479464979,69.76986177940948,,0,0,0,69.76986177940948,115.24143209385613,,0,0,0,115.24143209385613
86,LYS,8.16217456006216,,0,0,0,8.16217456006216,4.486334788125762,,0,0,0,4.486334788125762,174.2475267462482,,0,0,0,174.2475267462482,54.32449377231657,,0,0,0,54.32449377231657,32.47069214195249,,0,0,0,32.47069214195249,125.64624833619713,,0,0,0,125.64624833619713
87,PRO,,,0,0,0,,4.37739197944278,,0,0,0,4.37739197944278,176.98115196144968,,0,0,0,176.98115196144968,62.6410881004551,,0,0,0,62.6410881004551,31.80602344099234,,0,0,0,31.80602344099234,,,0,0,0,
88,SER,8.42090733918304,,0,0,0,8.42090733918304,4.481573259007659,,0,0,0,4.481573259007659,174.50585877809968,,0,0,0,174.50585877809968,58.40818394968365,,0,0,0,58.40818394968365,63.06189632903207,,0,0,0,63.06189632903207,118.82509357950383,,0,0,0,118.82509357950383
89,PHE,8.293574490320792,,0,0,0,8.293574490320792,4.492156214629814,,0,0,0,4.492156214629814,175.14077873431015,,0,0,0,175.14077873431015,58.07036461814297,,0,0,0,58.07036461814297,39.82583599846265,,0,0,0,39.82583599846265,122.74728144476634,,0,0,0,122.74728144476634