RESNUM,RESNAME,H_X,H_Y,H_BEST_REF_SCORE,H_BEST_REF_COV,H_BEST_REF_MATCH,H_UCBShift,HA_X,HA_Y,HA_BEST_REF_SCORE,HA_BEST_REF_COV,HA_BEST_REF_MATCH,HA_UCBShift,C_X,C_Y,C_BEST_REF_SCORE,C_BEST_REF_COV,C_BEST_REF_MATCH,C_UCBShift,CA_X,CA_Y,CA_BEST_REF_SCORE,CA_BEST_REF_COV,CA_BEST_REF_MATCH,CA_UCBShift,CB_X,CB_Y,CB_BEST_REF_SCORE,CB_BEST_REF_COV,CB_BEST_REF_MATCH,CB_UCBShift,N_X,N_Y,N_BEST_REF_SCORE,N_BEST_REF_COV,N_BEST_REF_MATCH,N_UCBShift
1,SER,8.406255915451217,,0.0,0.0,0,8.406255915451217,4.342131247075147,,0.0,0.0,0,4.342131247075147,173.7987936363137,,0.0,0.0,0,173.7987936363137,58.43021599458319,,0.0,0.0,0,58.43021599458319,63.48703951734932,,0.0,0.0,0,63.48703951734932,117.47501911173826,,0.0,0.0,0,117.47501911173826
2,HIS,8.446257834781886,,0.0,0.0,0,8.446257834781886,4.465180665645466,,0.0,0.0,0,4.465180665645466,175.1922489244311,,0.0,0.0,0,175.1922489244311,55.789346693445445,,0.0,0.0,0,55.789346693445445,29.17319155698191,,0.0,0.0,0,29.17319155698191,121.4541574451382,,0.0,0.0,0,121.4541574451382
3,MET,8.302352372538572,,0.0,0.0,0,8.302352372538572,4.384616273654124,,0.0,0.0,0,4.384616273654124,176.11364469375624,,0.0,0.0,0,176.11364469375624,55.16768517562437,,0.0,0.0,0,55.16768517562437,32.17800034874015,,0.0,0.0,0,32.17800034874015,122.84464839055944,,0.0,0.0,0,122.84464839055944
4,GLY,8.110259841386391,,0.0,0.0,0,8.110259841386391,3.90274289572372,,0.0,0.0,0,3.90274289572372,174.18351039937286,,0.0,0.0,0,174.18351039937286,45.02620709239649,,0.0,0.0,0,45.02620709239649,,,0.0,0.0,0,,110.55812377803862,,0.0,0.0,0,110.55812377803862
5,SER,8.33109203921634,,0.0,0.0,0,8.33109203921634,4.428859332611832,,0.0,0.0,0,4.428859332611832,174.59525264039848,,0.0,0.0,0,174.59525264039848,58.11915324004884,,0.0,0.0,0,58.11915324004884,63.64432051159951,,0.0,0.0,0,63.64432051159951,117.85691496159396,,0.0,0.0,0,117.85691496159396
6,LEU,8.036761263220113,,0.0,0.0,0,8.036761263220113,4.253057894047619,,0.0,0.0,0,4.253057894047619,176.94070770946274,,0.0,0.0,0,176.94070770946274,54.83439095901876,,0.0,0.0,0,54.83439095901876,42.24853747264957,,0.0,0.0,0,42.24853747264957,125.12045246186591,,0.0,0.0,0,125.12045246186591
7,ASN,8.378634815800867,,0.0,0.0,0,8.378634815800867,4.606262297008548,,0.0,0.0,0,4.606262297008548,175.7578450260184,,0.0,0.0,0,175.7578450260184,53.03515191716617,,0.0,0.0,0,53.03515191716617,38.86244091341991,,0.0,0.0,0,38.86244091341991,121.9050416419081,,0.0,0.0,0,121.9050416419081
8,ASP,8.717648147519148,,0.0,0.0,0,8.717648147519148,4.4643150721583975,,0.0,0.0,0,4.4643150721583975,177.13287150030527,,0.0,0.0,0,177.13287150030527,55.75828466779887,,0.0,0.0,0,55.75828466779887,40.09067038210679,,0.0,0.0,0,40.09067038210679,122.55648007791099,,0.0,0.0,0,122.55648007791099
9,SER,8.31162903946609,,0.0,0.0,0,8.31162903946609,4.236181488150738,,0.0,0.0,0,4.236181488150738,175.308938120979,,0.0,0.0,0,175.308938120979,60.05373524259629,,0.0,0.0,0,60.05373524259629,62.78625998732379,,0.0,0.0,0,62.78625998732379,115.51883779608725,,0.0,0.0,0,115.51883779608725
10,ASP,7.898803704745254,,0.0,0.0,0,7.898803704745254,4.758824016991342,,0.0,0.0,0,4.758824016991342,176.28856496709957,,0.0,0.0,0,176.28856496709957,54.291874130081034,,0.0,0.0,0,54.291874130081034,41.786136944499944,,0.0,0.0,0,41.786136944499944,119.97937562503608,,0.0,0.0,0,119.97937562503608
11,ILE,7.54225859009324,,0.0,0.0,0,7.54225859009324,4.169903778965479,,0.0,0.0,0,4.169903778965479,175.409369159546,,0.0,0.0,0,175.409369159546,61.374865395776446,,0.0,0.0,0,61.374865395776446,37.595002335042736,,0.0,0.0,0,37.595002335042736,120.86027273464869,,0.0,0.0,0,120.86027273464869
12,LYS,8.39548142975913,9.02,0.22152984936316716,0.35294117647058826,0,8.70476120947941,4.777253166749916,4.91,0.22152984936316716,0.35294117647058826,0,4.76621040979576,173.99758457884894,172.62,0.22152984936316716,0.35294117647058826,0,173.71966724737484,53.694398910989015,53.150000000000006,0.22152984936316716,0.35294117647058826,0,53.37002516872017,32.54487633920524,34.38,0.22152984936316716,0.35294117647058826,0,33.14885565773671,129.1068875708569,124.78,0.22152984936316716,0.35294117647058826,0,127.33885525600509
13,PRO,,,0.0,0.0,0,,4.026593235026085,,0.0,0.0,0,4.026593235026085,176.11936240077145,,0.0,0.0,0,176.11936240077145,63.11953408388833,,0.0,0.0,0,63.11953408388833,31.352336061610615,,0.0,0.0,0,31.352336061610615,,,0.0,0.0,0,
14,LEU,8.6090563997891,8.68,0.22152984936316716,0.35294117647058826,1,8.69456651962482,4.366420791697192,4.44,0.22152984936316716,0.35294117647058826,1,4.405465745754246,177.40971163238981,177.39,0.22152984936316716,0.35294117647058826,1,177.43850326100565,56.20183688060828,55.42,0.22152984936316716,0.35294117647058826,1,56.08242846798202,42.8929545983461,43.46,0.22152984936316716,0.35294117647058826,1,43.26197951779886,124.99539128795094,122.07,0.22152984936316716,0.35294117647058826,1,124.44323253000887
15,ARG,8.094215998229549,,0.0,0.0,0,8.094215998229549,4.463427548190698,,0.0,0.0,0,4.463427548190698,174.48134825365193,,0.0,0.0,0,174.48134825365193,55.53755464007659,,0.0,0.0,0,55.53755464007659,32.92398334350094,,0.0,0.0,0,32.92398334350094,118.28534933849484,,0.0,0.0,0,118.28534933849484
16,MET,8.529501588705738,,0.0,0.0,0,8.529501588705738,3.6270089473970475,,0.0,0.0,0,3.6270089473970475,175.10979251667777,,0.0,0.0,0,175.10979251667777,54.26284446039516,,0.0,0.0,0,54.26284446039516,32.77937337743368,,0.0,0.0,0,32.77937337743368,126.0560762012321,,0.0,0.0,0,126.0560762012321
17,ASP,8.18893460030525,7.98,0.22152984936316716,0.35294117647058826,0,8.019057452725054,4.854702196153847,4.83,0.22152984936316716,0.35294117647058826,0,4.848584084054835,175.73447157877123,175.08,0.22152984936316716,0.35294117647058826,0,174.9382480661172,52.946029684126984,53.11,0.22152984936316716,0.35294117647058826,0,53.28325235527251,41.28554970466755,40.07,0.22152984936316716,0.35294117647058826,0,40.86260398588634,123.75579268068599,122.81,0.22152984936316716,0.35294117647058826,0,122.84253252930958
18,PRO,,,0.0,0.0,0,,4.59614042977023,,0.0,0.0,0,4.59614042977023,171.53042684861805,,0.0,0.0,0,171.53042684861805,61.70008243379954,,0.0,0.0,0,61.70008243379954,30.716751114024863,,0.0,0.0,0,30.716751114024863,,,0.0,0.0,0,
19,PRO,,,0.0,0.0,0,,4.342116498626374,4.49,0.22152984936316716,0.35294117647058826,1,4.398667548551448,175.8795873823621,174.81,0.22152984936316716,0.35294117647058826,1,175.59258931391386,62.39112384920635,62.21,0.22152984936316716,0.35294117647058826,1,62.29749584857365,31.819325624680875,31.74,0.22152984936316716,0.35294117647058826,1,31.599765902319902,,,0.0,0.0,0,
20,VAL,8.402282694394493,,0.0,0.0,0,8.402282694394493,4.091484215290265,,0.0,0.0,0,4.091484215290265,175.7447017123654,,0.0,0.0,0,175.7447017123654,62.68997196081141,,0.0,0.0,0,62.68997196081141,32.656329137173934,,0.0,0.0,0,32.656329137173934,121.9533170981463,,0.0,0.0,0,121.9533170981463
21,TYR,8.500640548085247,8.69,0.22152984936316716,0.35294117647058826,1,8.536795823798423,4.755970589488289,4.83,0.22152984936316716,0.35294117647058826,1,4.731055757203907,174.61752517368743,175.17,0.22152984936316716,0.35294117647058826,1,174.63223102272173,55.697938467721166,55.38,0.22152984936316716,0.35294117647058826,1,55.60773456545121,38.915953598806745,39.72,0.22152984936316716,0.35294117647058826,1,39.36580191041181,127.63322142889332,125.82,0.22152984936316716,0.35294117647058826,1,126.66863859092018
22,PRO,,,0.0,0.0,0,,4.478816991419691,4.43,0.22152984936316716,0.35294117647058826,1,4.3832112496781,177.46886577608504,177.36,0.22152984936316716,0.35294117647058826,1,177.39700480921857,62.75380275153735,63.15,0.22152984936316716,0.35294117647058826,1,62.978136561183256,32.717724649500504,32.21,0.22152984936316716,0.35294117647058826,1,32.45342637397047,,,0.0,0.0,0,
23,ARG,8.841559926923077,,0.0,0.0,0,8.841559926923077,4.050608516522367,,0.0,0.0,0,4.050608516522367,178.22021632190032,,0.0,0.0,0,178.22021632190032,59.715468002059055,,0.0,0.0,0,59.715468002059055,30.06017161012321,,0.0,0.0,0,30.06017161012321,125.44787127264958,,0.0,0.0,0,125.44787127264958
24,MET,8.548595041958041,,0.0,0.0,0,8.548595041958041,4.177604204495504,,0.0,0.0,0,4.177604204495504,178.1898287373682,,0.0,0.0,0,178.1898287373682,58.651046987706735,,0.0,0.0,0,58.651046987706735,32.59894214280164,,0.0,0.0,0,32.59894214280164,118.09266070481185,,0.0,0.0,0,118.09266070481185
25,ALA,8.018352652680653,6.99,0.22152984936316716,0.35294117647058826,1,7.30794385993451,4.047638181274282,4.12,0.22152984936316716,0.35294117647058826,1,4.05216287950383,179.29192968504273,178.97,0.22152984936316716,0.35294117647058826,1,179.1672891193085,55.07529596491286,54.01,0.22152984936316716,0.35294117647058826,1,54.67868652454212,18.845410609118662,19.32,0.22152984936316716,0.35294117647058826,1,19.246395293179045,122.94998811722722,119.04,0.22152984936316716,0.35294117647058826,1,121.2754629976801
26,GLN,8.714287207137307,8.04,0.22152984936316716,0.35294117647058826,1,8.44765363981019,3.8420320047286047,4.01,0.22152984936316716,0.35294117647058826,1,3.9596408306859803,178.63376584687535,178.67,0.22152984936316716,0.35294117647058826,1,178.48965203989343,59.07356025769786,58.68,0.22152984936316716,0.35294117647058826,1,58.95994148374958,28.73346653121878,28.46,0.22152984936316716,0.35294117647058826,1,28.707414669902317,119.37181547086801,118.58,0.22152984936316716,0.35294117647058826,1,119.25569315137639
27,ALA,8.074465361582861,8.0,0.22152984936316716,0.35294117647058826,1,8.031639484448885,4.216595473754023,4.16,0.22152984936316716,0.35294117647058826,1,4.144382155194806,179.2165689616994,178.98,0.22152984936316716,0.35294117647058826,1,179.01417088509268,54.50843590801421,54.24,0.22152984936316716,0.35294117647058826,1,54.405193988861136,18.333742911394165,18.38,0.22152984936316716,0.35294117647058826,1,18.345914876784327,122.88352661886447,120.7,0.22152984936316716,0.35294117647058826,1,121.47931628168497
28,ARG,7.762828986091686,,0.0,0.0,0,7.762828986091686,4.44926856048951,,0.0,0.0,0,4.44926856048951,177.06381781308139,,0.0,0.0,0,177.06381781308139,56.117133232911534,,0.0,0.0,0,56.117133232911534,31.003559785458986,,0.0,0.0,0,31.003559785458986,115.64694572150071,,0.0,0.0,0,115.64694572150071
29,GLY,7.87574604022644,,0.0,0.0,0,7.87574604022644,3.9526777883505377,,0.0,0.0,0,3.9526777883505377,174.82161337852702,,0.0,0.0,0,174.82161337852702,46.13425108591964,,0.0,0.0,0,46.13425108591964,,,0.0,0.0,0,,108.51751113621378,,0.0,0.0,0,108.51751113621378
30,ILE,8.053286700432901,7.95,0.22152984936316716,0.35294117647058826,1,7.975729097263847,4.13109083063048,4.42,0.22152984936316716,0.35294117647058826,1,4.264827971678322,175.89274152122323,175.35,0.22152984936316716,0.35294117647058826,1,175.27595756725498,61.28388847622933,60.34,0.22152984936316716,0.35294117647058826,1,60.59909320914641,37.526798244538796,40.65,0.22152984936316716,0.35294117647058826,1,39.23041412121212,122.25230878106893,117.09,0.22152984936316716,0.35294117647058826,1,120.22017339926185
31,GLU,8.543546499517149,8.33,0.22152984936316716,0.35294117647058826,1,8.383145528671328,5.10686758006993,4.82,0.22152984936316716,0.35294117647058826,1,4.9489860495116,176.22426257215005,175.54,0.22152984936316716,0.35294117647058826,1,175.93596527407593,55.716470832184484,54.81,0.22152984936316716,0.35294117647058826,1,55.318264873465424,32.23174988109668,31.98,0.22152984936316716,0.35294117647058826,1,31.985159324764126,125.93591876020646,124.88,0.22152984936316716,0.35294117647058826,1,125.5798052396104
32,GLY,9.021546376584526,8.83,0.22152984936316716,0.35294117647058826,1,8.898409903130203,4.198983930724831,,0.0,0.0,0,4.198983930724831,172.59140451794318,172.47,0.22152984936316716,0.35294117647058826,1,172.4479021985126,46.05832899859585,45.81,0.22152984936316716,0.35294117647058826,1,45.774303533183485,,,0.0,0.0,0,,108.44613521701632,107.6,0.22152984936316716,0.35294117647058826,1,108.23792377982018
33,ARG,8.962519914907315,8.59,0.22152984936316716,0.35294117647058826,0,8.844192087340438,5.22652470961816,5.46,0.22152984936316716,0.35294117647058826,0,5.418123732134533,174.4192334940393,175.15,0.22152984936316716,0.35294117647058826,0,174.83693156501832,54.11536117366522,55.48,0.22152984936316716,0.35294117647058826,0,54.74479273954934,34.06053854983905,33.95,0.22152984936316716,0.35294117647058826,0,34.1672928081918,118.34870341091131,118.7,0.22152984936316716,0.35294117647058826,0,118.21912041162172
34,VAL,9.234741596237097,9.38,0.22152984936316716,0.35294117647058826,1,9.214077545576647,4.833515716017316,4.93,0.22152984936316716,0.35294117647058826,1,4.967351189427239,174.0170473014652,172.76,0.22152984936316716,0.35294117647058826,1,173.38270594861805,60.87402884881785,61.04,0.22152984936316716,0.35294117647058826,1,61.02708454981685,35.12247484496059,35.96,0.22152984936316716,0.35294117647058826,1,35.52492893162948,122.10860858470974,125.1,0.22152984936316716,0.35294117647058826,1,122.88965128347763
35,LYS,9.089841256637806,9.16,0.22152984936316716,0.35294117647058826,1,9.247925386302587,5.062815796991897,5.42,0.22152984936316716,0.35294117647058826,1,5.256652341625041,175.961974340232,175.69,0.22152984936316716,0.35294117647058826,1,175.72935638170716,55.532573756787656,55.42,0.22152984936316716,0.35294117647058826,1,55.47384752905983,34.27349175527806,34.38,0.22152984936316716,0.35294117647058826,1,34.39811559739705,128.8667329669497,129.99,0.22152984936316716,0.35294117647058826,1,129.53676244905097
36,VAL,9.25250588936619,9.33,0.22152984936316716,0.35294117647058826,1,9.281162208807858,5.1485717079476085,5.1,0.22152984936316716,0.35294117647058826,1,5.139584562898213,173.68066842148409,171.99,0.22152984936316716,0.35294117647058826,1,172.99013342789434,58.997967391175486,60.1,0.22152984936316716,0.35294117647058826,1,59.88996700260295,35.043528668764566,35.96,0.22152984936316716,0.35294117647058826,1,35.69536676935842,124.38468764393384,125.31,0.22152984936316716,0.35294117647058826,1,125.18794985394605
37,LEU,9.194833215512267,,0.0,0.0,0,9.194833215512267,5.257488625158176,,0.0,0.0,0,5.257488625158176,175.51367976273727,,0.0,0.0,0,175.51367976273727,53.75763709039849,,0.0,0.0,0,53.75763709039849,44.02904276489621,,0.0,0.0,0,44.02904276489621,128.72832396889777,,0.0,0.0,0,128.72832396889777
38,PHE,9.061303191996894,9.1,0.22152984936316716,0.35294117647058826,1,9.262227816716615,5.350824123082473,5.15,0.22152984936316716,0.35294117647058826,1,5.1738890129703625,173.03222387151183,171.31,0.22152984936316716,0.35294117647058826,1,172.18571861456877,55.776221862276614,56.35,0.22152984936316716,0.35294117647058826,1,56.10178050890221,41.54357569091464,40.88,0.22152984936316716,0.35294117647058826,1,41.38781811096681,123.26011448556443,121.5,0.22152984936316716,0.35294117647058826,1,123.06287408333888
39,THR,9.124770958635809,,0.0,0.0,0,9.124770958635809,4.9466622883838385,,0.0,0.0,0,4.9466622883838385,174.01810697052392,,0.0,0.0,0,174.01810697052392,61.786786093728495,,0.0,0.0,0,61.786786093728495,69.60938525666,,0.0,0.0,0,69.60938525666,118.18828912428683,,0.0,0.0,0,118.18828912428683
40,ILE,9.405315144827393,8.73,0.22152984936316716,0.35294117647058826,0,8.997516675835275,4.828281318786769,5.330000000000001,0.22152984936316716,0.35294117647058826,0,5.036010428049728,176.52381661221003,177.78,0.22152984936316716,0.35294117647058826,0,176.944951194228,60.80477154897325,59.94,0.22152984936316716,0.35294117647058826,0,60.41882545774226,38.004235368564764,39.99,0.22152984936316716,0.35294117647058826,0,38.961269083161284,127.74370167808858,120.82000000000001,0.22152984936316716,0.35294117647058826,0,127.93915036431348
41,THR,8.89028316928072,9.39,0.22152984936316716,0.35294117647058826,1,9.185927276257075,4.62998394086469,4.8,0.22152984936316716,0.35294117647058826,1,4.728107726118326,176.90497695809745,,0.0,0.0,0,176.90497695809745,60.761014214124764,62.1,0.22152984936316716,0.35294117647058826,1,61.19744163513708,71.3695362032523,68.02,0.22152984936316716,0.35294117647058826,1,69.63906181658342,119.02549592789433,117.19,0.22152984936316716,0.35294117647058826,1,118.72560105099899
42,SER,8.879318363653015,,0.0,0.0,0,8.879318363653015,4.190106492809968,,0.0,0.0,0,4.190106492809968,174.53280406189364,,0.0,0.0,0,174.53280406189364,60.845947187290484,,0.0,0.0,0,60.845947187290484,62.239558856465756,,0.0,0.0,0,62.239558856465756,116.09142223343879,,0.0,0.0,0,116.09142223343879
43,ASP,7.940816622266622,8.07,0.22152984936316716,0.35294117647058826,1,8.005742873692974,4.7481407208763455,4.84,0.22152984936316716,0.35294117647058826,1,4.701829453785104,176.83937265204796,176.05,0.22152984936316716,0.35294117647058826,1,176.0554209920413,53.800188764696415,53.11,0.22152984936316716,0.35294117647058826,1,53.15581636737707,41.22429742055722,39.71,0.22152984936316716,0.35294117647058826,1,40.58170923882784,119.68953720942946,112.67,0.22152984936316716,0.35294117647058826,1,116.24973065367966
44,GLY,8.412405005344656,8.38,0.22152984936316716,0.35294117647058826,1,8.493050627661228,4.03138295338273,,0.0,0.0,0,4.03138295338273,173.66034001835388,173.09,0.22152984936316716,0.35294117647058826,1,173.42812076682208,46.24947689224664,46.04,0.22152984936316716,0.35294117647058826,1,46.16144182811633,,,0.0,0.0,0,,108.96012059304584,108.6,0.22152984936316716,0.35294117647058826,1,108.82036331075035
45,ARG,7.690811316766567,7.51,0.22152984936316716,0.35294117647058826,1,7.526150548090799,4.745387880946831,4.89,0.22152984936316716,0.35294117647058826,1,4.762236609063159,175.4239439526085,174.86,0.22152984936316716,0.35294117647058826,1,175.21030875146522,55.63777056070041,53.76,0.22152984936316716,0.35294117647058826,1,54.27769019584304,32.01925651963037,31.74,0.22152984936316716,0.35294117647058826,1,32.00276271163836,118.90005336072817,118.07,0.22152984936316716,0.35294117647058826,1,118.75087727602397
46,ILE,8.43436891018426,8.56,0.22152984936316716,0.35294117647058826,0,8.33128130053835,4.8889795563658565,5.340000000000001,0.22152984936316716,0.35294117647058826,0,5.023383766333667,176.31830490203131,175.85,0.22152984936316716,0.35294117647058826,0,175.90902527267178,60.938518053635256,60.41,0.22152984936316716,0.35294117647058826,0,60.64087353058608,38.87886229282939,38.35,0.22152984936316716,0.35294117647058826,0,38.6536511000999,121.11251548739594,119.48,0.22152984936316716,0.35294117647058826,0,119.91726712375957
47,ASP,9.080640879187479,9.27,0.22152984936316716,0.35294117647058826,1,9.208310322871572,5.043681696214897,5.01,0.22152984936316716,0.35294117647058826,1,5.0206619506771,174.85517151961372,174.24,0.22152984936316716,0.35294117647058826,1,174.8143170379343,52.60986663365524,51.9,0.22152984936316716,0.35294117647058826,1,52.16382872393718,44.90798426270951,45.81,0.22152984936316716,0.35294117647058826,1,45.29877052375958,128.13109577515817,126.59,0.22152984936316716,0.35294117647058826,1,126.79350551159396
48,ASP,8.8631753494894,8.709999999999999,0.22152984936316716,0.35294117647058826,0,8.69796154980575,4.438243931959707,4.55,0.22152984936316716,0.35294117647058826,0,4.45693511955267,175.03792623013655,174.91000000000003,0.22152984936316716,0.35294117647058826,0,175.04803263132425,55.32839966434122,54.17,0.22152984936316716,0.35294117647058826,0,55.17815546888112,39.89468381640027,38.870000000000005,0.22152984936316716,0.35294117647058826,0,39.36512588725164,119.67853837178377,119.63000000000001,0.22152984936316716,0.35294117647058826,0,120.01929728245089
49,ILE,8.207949625513375,8.07,0.22152984936316716,0.35294117647058826,0,8.116049343262294,4.678277126767677,4.430000000000001,0.22152984936316716,0.35294117647058826,0,4.509026453169054,176.63915888004217,177.16,0.22152984936316716,0.35294117647058826,0,176.5862942532079,61.44604777873238,62.99,0.22152984936316716,0.35294117647058826,0,61.79696190642691,38.503250928765674,37.17,0.22152984936316716,0.35294117647058826,0,37.652260499489394,119.26381816993563,118.36,0.22152984936316716,0.35294117647058826,0,119.5176292533189
50,GLN,9.14966878027528,9.71,0.22152984936316716,0.35294117647058826,1,9.435495248629149,4.5645670235042735,4.63,0.22152984936316716,0.35294117647058826,1,4.5861290387001885,174.61401501947498,174.49,0.22152984936316716,0.35294117647058826,1,174.74127798847817,54.28407778950494,54.24,0.22152984936316716,0.35294117647058826,1,54.32924041572317,31.647975727566877,31.74,0.22152984936316716,0.35294117647058826,1,31.569393565828616,127.50157071466866,129.34,0.22152984936316716,0.35294117647058826,1,128.5799324088467
51,VAL,8.945616627439227,9.02,0.22152984936316716,0.35294117647058826,0,8.894560412842711,4.038896142374292,3.8099999999999996,0.22152984936316716,0.35294117647058826,0,3.990971604378954,175.8289496954712,176.13,0.22152984936316716,0.35294117647058826,0,176.2030110991786,62.97147022474748,61.910000000000004,0.22152984936316716,0.35294117647058826,0,62.508492691258745,31.670068531562883,29.83,0.22152984936316716,0.35294117647058826,0,30.714683914158066,124.76952416426352,124.17,0.22152984936316716,0.35294117647058826,0,124.64779455708737
52,LEU,9.056240396248196,9.19,0.22152984936316716,0.35294117647058826,1,9.092378043745143,4.441348628421578,4.37,0.22152984936316716,0.35294117647058826,1,4.373479197990898,177.76530037345432,177.78,0.22152984936316716,0.35294117647058826,1,177.57323238165722,56.20061659604285,56.35,0.22152984936316716,0.35294117647058826,1,56.22363134666445,42.500483372843824,42.53,0.22152984936316716,0.35294117647058826,1,42.591317126551225,129.7549477541847,130.7,0.22152984936316716,0.35294117647058826,1,130.5891498451937
53,GLU,8.17725136063381,,0.0,0.0,0,8.17725136063381,4.552125833422133,,0.0,0.0,0,4.552125833422133,174.57662436844822,,0.0,0.0,0,174.57662436844822,55.90037840815851,,0.0,0.0,0,55.90037840815851,33.070858693750694,,0.0,0.0,0,33.070858693750694,117.50257508908314,,0.0,0.0,0,117.50257508908314
54,SER,8.681330824791875,8.49,0.22152984936316716,0.35294117647058826,0,8.54482231015651,5.275454325718725,5.14,0.22152984936316716,0.35294117647058826,0,5.215575036785437,172.62482923414362,,0.0,0.0,0,172.62482923414362,57.80926972643467,57.839999999999996,0.22152984936316716,0.35294117647058826,0,57.51131498293928,65.08793023444333,67.07,0.22152984936316716,0.35294117647058826,0,66.2010899522089,119.5988409573038,118.82000000000001,0.22152984936316716,0.35294117647058826,0,119.68830525538351
55,VAL,9.154028297102895,,0.0,0.0,0,9.154028297102895,4.678964137617938,,0.0,0.0,0,4.678964137617938,173.66185219867356,,0.0,0.0,0,173.66185219867356,59.13865080396825,,0.0,0.0,0,59.13865080396825,35.267946000033305,,0.0,0.0,0,35.267946000033305,127.2574202525086,,0.0,0.0,0,127.2574202525086
56,PRO,,,0.0,0.0,0,,4.746283268623044,4.89,0.22152984936316716,0.35294117647058826,1,4.728000453141304,176.17741761762682,175.35,0.22152984936316716,0.35294117647058826,1,175.95898287994783,63.142627525929626,62.85,0.22152984936316716,0.35294117647058826,1,62.645714414324566,34.08138221794317,34.32,0.22152984936316716,0.35294117647058826,1,34.10292060496726,,,0.0,0.0,0,
57,SER,8.450521581807083,8.63,0.22152984936316716,0.35294117647058826,0,8.521409770113221,4.295052002442002,4.1,0.22152984936316716,0.35294117647058826,0,4.1780416690476185,175.41364430635474,174.14999999999998,0.22152984936316716,0.35294117647058826,0,174.55419488235097,59.62520806109446,58.169999999999995,0.22152984936316716,0.35294117647058826,0,59.417501616872016,62.934939650499494,64.72,0.22152984936316716,0.35294117647058826,0,63.62910767020757,117.93508691930847,114.77000000000001,0.22152984936316716,0.35294117647058826,0,117.05515515171496
58,ARG,8.567326136030637,,0.0,0.0,0,8.567326136030637,4.090959021606172,,0.0,0.0,0,4.090959021606172,176.6319424210623,,0.0,0.0,0,176.6319424210623,57.678012432817184,,0.0,0.0,0,57.678012432817184,28.16215312395382,,0.0,0.0,0,28.16215312395382,118.23047780238095,,0.0,0.0,0,118.23047780238095